{"text_format":"3","workbook":"xlsx","n_sheets":11,"sheets":["表紙","書式1","書式3","承諾書","応募オフィス名称確認書","Record1","処理中","Record3","list","Sheet3","Sheet4"],"not_rendered":{"images":8,"macros":1,"external_links":2,"defined_names":30},"read":"whole","date_system":"1900"}

{"sheet":"表紙","index":0,"n_rows":102,"n_cols":1,"rows_kept":102,"merged":[[6,2,6,10],[9,5,9,7]]}
{"$rows_empty":101}
["応募"]

{"sheet":"書式1","index":1,"n_rows":132,"n_cols":8,"rows_kept":132,"merged":[[0,1,0,4],[1,2,1,4],[4,1,4,2],[4,3,4,4],[5,3,5,4],[6,3,6,4],[7,3,7,4],[10,3,10,4],[11,3,11,4],[12,3,12,4],[15,3,15,4],[16,3,16,4],[18,1,18,2],[22,3,22,4],[23,3,23,4],[26,3,26,4],[27,3,27,4],[28,3,28,4],[32,1,32,2],[32,3,32,4],[34,1,34,2],[34,3,34,4],[37,3,38,4],[39,3,39,4],[40,3,43,4],[44,3,44,4],[47,3,47,4],[48,3,48,4],[49,3,49,4],[50,3,50,4],[51,3,51,4],[52,3,52,4],[53,3,53,4],[54,3,54,4],[55,3,55,4],[57,3,57,4],[58,3,58,4],[59,3,59,4],[60,3,60,4],[61,3,61,4],[62,3,62,4],[63,3,63,4],[64,3,64,4],[65,3,65,4],[66,3,66,4],[67,3,67,4],[69,1,75,1],[69,3,69,4],[70,3,70,4],[71,3,71,4],[75,3,75,4],[77,3,77,4],[78,3,78,4],[79,3,79,4],[80,1,80,2],[80,3,80,4],[81,1,87,1],[81,3,81,4],[82,3,82,4],[83,3,83,4],[87,3,87,4],[89,3,89,4],[90,3,90,4],[91,3,91,4],[92,1,92,2],[92,3,92,4],[93,1,99,1],[93,3,93,4],[94,3,94,4],[95,3,95,4],[99,3,99,4],[101,3,101,4],[102,3,102,4],[103,3,103,4],[104,1,104,2],[104,3,104,4],[106,3,106,4],[108,3,108,4],[110,1,110,2],[111,1,111,2],[112,1,112,2],[113,1,113,2],[115,1,115,2],[115,3,115,4],[119,3,119,4],[122,1,124,1],[122,3,122,4],[123,3,123,4],[126,1,126,2]]}
[null,"※応募受付完了後に応募者からの依頼による応募書類記載内容の変更はできません。 \n記載漏れ、間違いがないか確認の上、アップロードしてください。"]
[null,"1｜応募プロフィール"]
[]
[null,"応募企業・団体",null,"必要事項を記入し、該当する個所を選択してください。"]
[null,"企業・団体名（代表企業・団体）",{"$nulls":5},"記述（内容40字以内）"]
[null,"（英文字）",{"$nulls":5},"記述（内容40字以内）"]
{"$rows_left_out":127}
{"sheet":"書式3","index":2,"n_rows":373,"n_cols":2,"rows_kept":373,"hidden":true,"merged":[[3,1,3,9],[321,1,321,9],[372,1,372,9]]}
[]
[null,"3｜施設・空間の概要"]
[]
[null,"１． オフィスの概要がわかる写真を貼付してください。（カラー写真）\n２． 写真は、枚数および大きさは問いませんが書式３－１から書式３－６に収めてください。\n３． すべての写真にはスペース名と簡単な説明を付けてください。\n４． 受付、ロビー、エントランス、一般執務スペース、リフレッシュエリア、会議室、応接室の写真は必ず入れてください。（一般執務スペースの写真は、仕事をしているオフィスワーカーが写っているものに限ります。）"]
{"$rows_empty":317}
[null,"「レイアウト図（図面）」\nオフィス全体が分かるレイアウト図を貼付し、動線、レイアウト、空間などの使い方について、簡潔に説明を加えてください（図中に基準寸法または全体寸法を表示してください）。"]
{"$rows_left_out":3}
{"sheet":"承諾書","index":3,"n_rows":4,"n_cols":6,"rows_kept":4,"merged":[[5,4,5,5],[11,2,11,5],[13,2,13,5],[14,2,14,5],[15,2,15,5],[16,2,16,5],[18,4,18,5],[19,4,19,5],[21,3,21,5],[22,3,22,5],[23,4,23,5],[24,4,24,5],[25,3,25,5],[26,3,26,5],[27,3,27,5],[30,2,30,5],[33,2,35,5],[37,2,37,5],[47,2,47,5]]}
[]
[]
[]
[{"$nulls":5}," 応募番号："]

{"sheet":"応募オフィス名称確認書","index":4,"n_rows":89,"n_cols":22,"rows_kept":89,"merged":[[9,2,16,21],[20,2,21,21],[23,2,23,21],[27,2,29,21],[50,2,60,21],[61,2,68,21],[70,2,75,21],[81,2,81,21]]}
[]
[]
[{"$nulls":13}," 応募番号："]
[null,null,"応募者各位"]
[{"$nulls":21},"一般社団法人ニューオフィス推進協会"]
[{"$nulls":21},"日経ニューオフィス賞本部事務局"]
{"$rows_left_out":50}
{"sheet":"Record1","index":5,"n_rows":42,"n_cols":159,"rows_kept":42,"hidden":true}
[{"$f":"CELL(\"filename\")","v":"C:\\Users\\渡邉亜実\\Desktop\\02 block変換\\202205test\\[35th_entry.xlsm]表紙"},null,null,5,6,7,8,9,10,10,11,12,13,14,15,16,17,18,19,20,20,21,21,23,24,25,26,26,27,28,29,30,30,31,31,32,32,33,34,34,35,36,36,37,38,38,38,38,38,38,38,38,40,41,41,41,41,41,41,41,41,45,46,48,49,50,51,52,53,54,54,55,55,56,56,58,58,59,59,60,61,62,63,64,65,66,66,66,67,67,67,68,68,70,71,72,73,74,75,76,77,78,78,79,80,81,82,83,84,85,86,87,88,89,90,90,91,92,93,94,95,96,97,98,99,100,101,102,102,103,104,105,107,108,110,111,112,113,114,115,116,117,118,119,120,120,121,122,123,123,124,124,125,127,128,130,131,132,"END"]
[{"$f":"FIND(\"[\",A1,1)","v":45},null,null,{"$f":"IF(INDIRECT(\"書式1!\"&\"B\"&D1)=\"\",\"\",INDIRECT(\"書式1!\"&\"B\"&D1))","v":"企業・団体名（代表企業・団体）"},"（英文字）","URL","","本社所在地","","","","","","","","代表者名","","資本金・出資金","応募時点の全従業員数\n(正規雇用・非正規雇用・受入出向・派遣社員を含む）","業種","業種","上場","上場","応募オフィス名称","※必ず記入要領を参照してください。","応募オフィス所在地","","","","","","建物の規模",{"$f":"IF(INDIRECT(\"書式1!\"&\"B\"&AG1)=\"\",\"\",INDIRECT(\"書式1!\"&\"B\"&AG1))","v":"建物の規模"},"","","応募企業・団体の入居",{"$f":"IF(INDIRECT(\"書式1!\"&\"B\"&AK1)=\"\",\"\",INDIRECT(\"書式1!\"&\"B\"&AK1))","v":"応募企業・団体の入居"},"「建物の部分」の場合は、階を記入→","応募オフィスの範囲","応募オフィスの範囲",{"$f":"IF(INDIRECT(\"書式1!\"&\"B\"&AO1)=\"\",\"\",INDIRECT(\"書式1!\"&\"B\"&AO1))","v":"応募オフィスの範囲が、上記のＡ）またはＢ）の\n一部分の場合は、特定した理由と、その階を記入→"},"建物の築年数","建物の築年数","応募オフィスの延床面積","応募オフィスの種類","応募オフィスの種類","応募オフィスの種類","応募オフィスの種類","応募オフィスの種類","応募オフィスの種類","応募オフィスの種類","応募オフィスの種類","","応募オフィスの主たる業務","応募オフィスの主たる業務","応募オフィスの主たる業務","応募オフィスの主たる業務","応募オフィスの主たる業務","応募オフィスの主たる業務","応募オフィスの主たる業務","応募オフィスの主たる業務","","応募オフィスの従業員数","応募オフィスの企画者・部門 社内","　　　〃　　　　 設計者・部門 社内","　　　〃　　　　 施工者・部門 社内","応募オフィスの企画者・部門 社外","　　　〃　　　　 設計者・部門 社外","　　　〃　　　　 施工者・部門 社外",{"$f":"IF(INDIRECT(\"書式1!\"&\"B\"&BR1)=\"\",\"\",INDIRECT(\"書式1!\"&\"B\"&BR1))","v":"オフィス内装の区分"},"オフィス内装の区分","オフィス家具の区分","オフィス家具の区分","オフィス機器の区分","オフィス機器の区分","建物の所有形態","建物の所有形態","建物の入居状況","建物の入居状況","建物の企画者・部門 社内"," 〃  の設計者・部門 社内"," 〃  の工事者・部門 社内","建物の企画者・部門 社外"," 〃  の設計者・部門 社外"," 〃  の工事者・部門 社外","使用開始までのプロセス","使用開始までのプロセス","使用開始までのプロセス","","","","","","応募責任者　　【必須】\n応募全体に責任をもつ方\n\n社外の人でなく、必ず、応募企業・団体の中から選出してください。","",{"$f":"IF(INDIRECT(\"書式1!\"&\"B\"&CR1)=\"\",\"\",INDIRECT(\"書式1!\"&\"B\"&CR1))","v":""},"","","","","応募責任者の所在地","",{"$f":"IF(INDIRECT(\"書式1!\"&\"B\"&CY1)=\"\",\"\",INDIRECT(\"書式1!\"&\"B\"&CY1))","v":""},"","","応募責任者住所表示確認欄［⑩⑪⑫］","応募担当者　　【必須】\n連絡窓口となって頂ける方\n応募後の連絡が必ず通じる方\n\n社外の人でなく、必ず、応募企業・団体の中から選出してください。","",{"$f":"IF(INDIRECT(\"書式1!\"&\"B\"&DE1)=\"\",\"\",INDIRECT(\"書式1!\"&\"B\"&DE1))","v":""},"","","","","応募担当者の所在地","","","","","応募担当者住所表示確認欄[⑬⑭⑮]","応募担当補佐　　【任意】\n応募後の連絡が「応募担当者」と同様に通じる方\n\n※「応募担当者」の連絡が通じ難い場合は、「担当補佐」の記入を併せてお願いします\n\n社外の人でなく、必ず、応募企業・団体の中から選出してください。\n","",{"$f":"IF(INDIRECT(\"書式1!\"&\"B\"&DR1)=\"\",\"\",INDIRECT(\"書式1!\"&\"B\"&DR1))","v":""},"","","","","応募担当補佐の所在地","",null,{"$f":"IF(INDIRECT(\"書式1!\"&\"B\"&DZ1)=\"\",\"\",INDIRECT(\"書式1!\"&\"B\"&DZ1))","v":""},"","応募担当補佐住所表示確認欄[⑯⑰⑱]","応募オフィスの延床面積[⑧]","オフィス構築の総費用","(内訳）　　企画・設計費","　　　　　　内装費","　　　　　　オフィス家具（施工含む）","　　　　　　オフィス機器（施工含む）","　　　　　　その他（引越し費用等）","","応募オフィスの従業員数［⑨］","天井高さ（床仕上げ面から）","一般執務スペース","執務用総席数","主なオフィスの運用方式","主なオフィスの運用方式","共有書類の総収容可能量","個人の書類等の収容量","オフィスづくりやオフィスの運用に関する調査の実施","オフィスづくりやオフィスの運用に関する調査の実施",{"$f":"+ES2","v":"オフィスづくりやオフィスの運用に関する調査の実施"},{"$f":"+ET2","v":"オフィスづくりやオフィスの運用に関する調査の実施"},{"$f":"+EU2","v":"オフィスづくりやオフィスの運用に関する調査の実施"},{"$f":"IF(INDIRECT(\"書式1!\"&\"B\"&EX1)=\"\",\"\",INDIRECT(\"書式1!\"&\"B\"&EX1))","v":"延床面積\n自社ビルの場合記入する。オフィスビル内に駐車場があるときにはそれも含めてください。"},{"$f":"IF(INDIRECT(\"書式1!\"&\"B\"&EY1)=\"\",\"\",INDIRECT(\"書式1!\"&\"B\"&EY1))","v":"建物の総費用\n自社ビルの場合記入する。"},{"$f":"IF(INDIRECT(\"書式1!\"&\"B\"&EZ1)=\"\",\"\",INDIRECT(\"書式1!\"&\"B\"&EZ1))","v":"(内訳) 　　企画・設計費"},{"$f":"IF(INDIRECT(\"書式1!\"&\"B\"&FA1)=\"\",\"\",INDIRECT(\"書式1!\"&\"B\"&FA1))","v":"　　　　　　工事費"},{"$f":"IF(INDIRECT(\"書式1!\"&\"B\"&FB1)=\"\",\"\",INDIRECT(\"書式1!\"&\"B\"&FB1))","v":""},"END"]
[{"$f":"FIND(\"]\",A1,1)","v":61},null,null,{"$f":"IF(INDIRECT(\"書式1!\"&\"C\"&D1)=\"\",\"\",INDIRECT(\"書式1!\"&\"C\"&D1))","v":""},"","","URL確認欄［①］","〒","都道府県","都道府県","市区町村番地","建物名","本社所在地表示確認欄［②③④］","電話","FAX","役職名","代表者氏名","","","","","","","","フリガナ","〒","都道府県","都道府県","市区町村番地","建物名","応募オフィス所在地表示確認欄［⑤⑥⑦］","地上",{"$f":"IF(INDIRECT(\"書式1!\"&\"C\"&AG1)=\"\",\"\",INDIRECT(\"書式1!\"&\"C\"&AG1))","v":"地上"},"地下","地下","",{"$f":"IF(INDIRECT(\"書式1!\"&\"C\"&AK1)=\"\",\"\",INDIRECT(\"書式1!\"&\"C\"&AK1))","v":""},"","","",{"$f":"IF(INDIRECT(\"書式1!\"&\"C\"&AO1)=\"\",\"\",INDIRECT(\"書式1!\"&\"C\"&AO1))","v":""},"","","","","","","","","","","","その他","","","","","",null,null,{"$f":"IF(INDIRECT(\"書式1!\"&\"C\"&BI1)=\"\",\"\",INDIRECT(\"書式1!\"&\"C\"&BI1))","v":""},{"$f":"IF(INDIRECT(\"書式1!\"&\"C\"&BJ1)=\"\",\"\",INDIRECT(\"書式1!\"&\"C\"&BJ1))","v":"その他"},{"$f":"IF(INDIRECT(\"書式1!\"&\"C\"&BK1)=\"\",\"\",INDIRECT(\"書式1!\"&\"C\"&BK1))","v":""},{"$f":"IF(INDIRECT(\"書式1!\"&\"C\"&BL1)=\"\",\"\",INDIRECT(\"書式1!\"&\"C\"&BL1))","v":""},{"$f":"+BL3","v":""},{"$f":"+BM3","v":""},{"$f":"IF(INDIRECT(\"書式1!\"&\"C\"&BO1)=\"\",\"\",INDIRECT(\"書式1!\"&\"C\"&BO1))","v":""},{"$f":"+BO3","v":""},{"$f":"+BP3","v":""},{"$f":"IF(INDIRECT(\"書式1!\"&\"C\"&BR1)=\"\",\"\",INDIRECT(\"書式1!\"&\"C\"&BR1))","v":""},"","","","","","","","","",{"$f":"+CA3","v":""},"","","","","",{"$f":"IF(INDIRECT(\"書式1!\"&\"C\"&CH1)=\"\",\"\",INDIRECT(\"書式1!\"&\"C\"&CH1))","v":"建物の施工"},{"$f":"+CH3","v":"建物の施工"},{"$f":"+CI3","v":"建物の施工"},{"$f":"IF(INDIRECT(\"書式1!\"&\"C\"&CK1)=\"\",\"\",INDIRECT(\"書式1!\"&\"C\"&CK1))","v":"オフィスの施工"},{"$f":"+CK3","v":"オフィスの施工"},{"$f":"+CL3","v":"オフィスの施工"},{"$f":"IF(INDIRECT(\"書式1!\"&\"C\"&CN1)=\"\",\"\",INDIRECT(\"書式1!\"&\"C\"&CN1))","v":"使用開始"},{"$f":"+CN3","v":"使用開始"},{"$f":"IF(INDIRECT(\"書式1!\"&\"C\"&CP1)=\"\",\"\",INDIRECT(\"書式1!\"&\"C\"&CP1))","v":"氏名"},"所属",{"$f":"IF(INDIRECT(\"書式1!\"&\"C\"&CR1)=\"\",\"\",INDIRECT(\"書式1!\"&\"C\"&CR1))","v":"役職"},"電話","携帯電話","FAX","Eメール","〒","都道府県","都道府県","市区町村番地","建物名","","氏名","所属",{"$f":"IF(INDIRECT(\"書式1!\"&\"C\"&DE1)=\"\",\"\",INDIRECT(\"書式1!\"&\"C\"&DE1))","v":"役職"},"電話","携帯電話","FAX","Eメール","〒","都道府県","都道府県","市区町村番地","建物名","","氏名","所属",{"$f":"IF(INDIRECT(\"書式1!\"&\"C\"&DR1)=\"\",\"\",INDIRECT(\"書式1!\"&\"C\"&DR1))","v":"役職"},"電話","携帯電話","FAX","Eメール","〒","都道府県",{"$f":"IF(INDIRECT(\"書式1!\"&\"C\"&DY1)=\"\",\"\",INDIRECT(\"書式1!\"&\"C\"&DY1))","v":"都道府県"},"市区町村番地","建物名","","","","","","","","","%計","","","","","","","","","企画・設計時","企画・設計時","使用開始時","使用開始時","定期的","","","","","%計","END"]
[{"$f":"MID(A1,A2+1,A3-A2-1)","v":"35th_entry.xlsm"},null,"単位→",{"$nulls":155},"END"]
["書式4.設問1-72",{"$nulls":43},"本社　","支社･支店　","研究所　","コールセンター　","店舗","ショールーム","その他",null,null,"総務・経理・人事　　","資材・調達・購買　　","企画・計画　　","設計・技術・研究 　　","営業・販売　　","生産管理・製造管理　　","その他",{"$nulls":25},"建築施工","建築施工開始","建築施工終了","オフィス施工","オフィス施工開始","オフィス施工終了","使用開始","使用開始日付","応募責任者","応募責任者","応募責任者","応募責任者","応募責任者","応募責任者","応募責任者","応募責任者","応募責任者","応募責任者","応募責任者","応募責任者",null,"応募担当者","応募担当者","応募担当者","応募担当者","応募担当者","応募担当者","応募担当者","応募担当者","応募担当者","応募担当者","応募担当者","応募担当者",null,"応募担当補佐","応募担当補佐","応募担当補佐","応募担当補佐","応募担当補佐","応募担当補佐","応募担当補佐","応募担当補佐","応募担当補佐","応募担当補佐","応募担当補佐","応募担当補佐",{"$nulls":22},"延床面積","建物の総費用",{"$nulls":3},"END"]
["ファイル名","日付","ユニーク値",{"$f":"+D2&D3","v":"企業・団体名（代表企業・団体）"},{"$f":"+E2&E3","v":"（英文字）"},{"$f":"+F2&F3","v":"URL"},{"$f":"+G2&G3","v":"URL確認欄［①］"},{"$f":"+H2&H3","v":"本社所在地〒"},{"$f":"+I2&I3&I7","v":"都道府県"},"都道府県（値）","市区町村番地","建物名","本社所在地表示確認欄［②③④］","電話","FAX","代表者名役職名","代表者氏名","資本金・出資金","応募時点の全従業員数\n(正規雇用・非正規雇用・受入出向・派遣社員を含む）","業種","業種（値）","上場","上場（値）","応募オフィス名称","※必ず記入要領を参照してください。フリガナ","応募オフィス所在地〒","都道府県","都道府県（値）","市区町村番地","建物名","応募オフィス所在地表示確認欄［⑤⑥⑦］","建物の規模地上",{"$f":"+AG2&AG3&AG7","v":"建物の規模地上（値）"},"地下","地下（値）","応募企業・団体の入居","応募企業・団体の入居（値）",{"$f":"+AL2&AL3&AL7","v":"「建物の部分」の場合は、階を記入→"},"応募オフィスの範囲","応募オフィスの範囲（値）","応募オフィスの範囲が、上記のＡ）またはＢ）の\n一部分の場合は、特定した理由と、その階を記入→","建物の築年数（年）","建物の築年数（月）","応募オフィスの延床面積",{"$f":"+AS5","v":"本社　"},"支社･支店　","研究所　","コールセンター　","店舗","ショールーム","その他",{"$f":"+AZ2&AZ3&AZ7","v":"応募オフィスの種類（値）"},{"$f":"+BA2&BA3&BA7","v":"その他"},{"$f":"+BB5","v":"総務・経理・人事　　"},"資材・調達・購買　　","企画・計画　　","設計・技術・研究 　　","営業・販売　　","生産管理・製造管理　　","その他",{"$f":"+BI2&BI3&BI7","v":"応募オフィスの主たる業務（値）"},"その他","応募オフィスの従業員数","応募オフィスの企画者・部門 社内","　　　〃　　　　 設計者・部門 社内","　　　〃　　　　 施工者・部門 社内","応募オフィスの企画者・部門 社外","　　　〃　　　　 設計者・部門 社外","　　　〃　　　　 施工者・部門 社外","オフィス内装の区分","オフィス内装の区分（値）","オフィス家具の区分","オフィス家具の区分（値）","オフィス機器の区分","オフィス機器の区分（値）","建物の所有形態","建物の所有形態（値）","建物の入居状況","建物の入居状況（値）","建物の企画者・部門 社内"," 〃  の設計者・部門 社内"," 〃  の工事者・部門 社内","建物の企画者・部門 社外"," 〃  の設計者・部門 社外"," 〃  の工事者・部門 社外",{"$f":"+CH5","v":"建築施工"},"建築施工開始","建築施工終了","オフィス施工","オフィス施工開始","オフィス施工終了","使用開始",{"$f":"+CO5","v":"使用開始日付"},{"$f":"+CP5&\"-\"&CP3","v":"応募責任者-氏名"},"応募責任者-所属",{"$f":"+CR5&\"-\"&CR3","v":"応募責任者-役職"},"応募責任者-電話","応募責任者-携帯電話","応募責任者-FAX","応募責任者-Eメール","応募責任者-〒","応募責任者-都道府県",{"$f":"+CY5&\"-\"&CY3&CY7","v":"応募責任者-都道府県（値）"},{"$f":"+CZ5&\"-\"&CZ3","v":"応募責任者-市区町村番地"},{"$f":"+DA5&\"-\"&DA3","v":"応募責任者-建物名"},{"$f":"+DB2","v":"応募責任者住所表示確認欄［⑩⑪⑫］"},{"$f":"+DC5&\"-\"&DC3","v":"応募担当者-氏名"},"応募担当者-所属",{"$f":"+DE5&\"-\"&DE3","v":"応募担当者-役職"},"応募担当者-電話","応募担当者-携帯電話","応募担当者-FAX","応募担当者-Eメール","応募担当者-〒","応募担当者-都道府県",{"$f":"+DL5&\"-\"&DL3&DL7","v":"応募担当者-都道府県（値）"},{"$f":"+DM5&\"-\"&DM3","v":"応募担当者-市区町村番地"},{"$f":"+DN5&\"-\"&DN3","v":"応募担当者-建物名"},{"$f":"+DO2","v":"応募担当者住所表示確認欄[⑬⑭⑮]"},{"$f":"+DP5&\"-\"&DP3","v":"応募担当補佐-氏名"},"応募担当補佐-所属",{"$f":"+DR5&\"-\"&DR3","v":"応募担当補佐-役職"},"応募担当補佐-電話","応募担当補佐-携帯電話","応募担当補佐-FAX","応募担当補佐-Eメール","応募担当補佐-〒","応募担当補佐-都道府県",{"$f":"+DY5&\"-\"&DY3&DY7","v":"応募担当補佐-都道府県（値）"},{"$f":"+DZ5&\"-\"&DZ3","v":"応募担当補佐-市区町村番地"},{"$f":"+EA5&\"-\"&EA3","v":"応募担当補佐-建物名"},{"$f":"+EB2","v":"応募担当補佐住所表示確認欄[⑯⑰⑱]"},{"$f":"TRIM(EC2&EC3&EC7)","v":"応募オフィスの延床面積[⑧]"},"オフィス構築の総費用","(内訳）　企画・設計費","内装費","オフィス家具（施工含む）","オフィス機器（施工含む）","その他（引越し費用等）","%計","応募オフィスの従業員数［⑨］","天井高さ（床仕上げ面から）","一般執務スペース","執務用総席数","主なオフィスの運用方式","主なオフィスの運用方式（値）","共有書類の総収容可能量","個人の書類等の収容量",{"$f":"+ES2&\"-\"&ES3&ES7","v":"オフィスづくりやオフィスの運用に関する調査の実施-企画・設計時"},{"$f":"+ET2&\"-\"&ET3&ET7","v":"オフィスづくりやオフィスの運用に関する調査の実施-企画・設計時（値）"},{"$f":"+EU2&\"-\"&EU3&EU7","v":"オフィスづくりやオフィスの運用に関する調査の実施-使用開始時"},{"$f":"+EV2&\"-\"&EV3&EV7","v":"オフィスづくりやオフィスの運用に関する調査の実施-使用開始時（値）"},{"$f":"+EW2&\"-\"&EW3&EW7","v":"オフィスづくりやオフィスの運用に関する調査の実施-定期的"},{"$f":"+EX5","v":"延床面積"},{"$f":"+EY2&EY3&EY7","v":"建物の総費用\n自社ビルの場合記入する。"},{"$f":"TRIM(EZ2&EZ3&EZ7)","v":"(内訳) 企画・設計費"},"工事費","%計","END"]
{"$rows_left_out":15}
{"sheet":"処理中","index":6,"n_rows":19,"n_cols":4,"rows_kept":19,"hidden":true}
{"$rows_empty":13}
[{"$nulls":3},"処　理　中"]
[]
[]
[]
[]
{"$rows_left_out":2}
{"sheet":"Record3","index":7,"n_rows":19,"n_cols":127,"rows_kept":19,"hidden":true}
[{"$nulls":3},"地球環境保全",{"$nulls":71},"オフィスセキュリティ"]
[{"$nulls":3},"省エネ対策",{"$nulls":24},"会議スペース",{"$nulls":10},"接客スペース",{"$nulls":14},"リフレッシュスペース",{"$nulls":8},"喫煙スペース",{"$nulls":11},"組織的セキュリティ対策",{"$nulls":3},"人的セキュリティ対策",null,"資産の分類及び管理",{"$nulls":6},"物理的セキュリティ対策",{"$nulls":28},"技術的セキュリティ対策",{"$nulls":7},"事業継続管理"]
[{"$nulls":3},152,{"$nulls":3},153,null,null,154,155,{"$nulls":5},156,null,157,158,null,159,{"$nulls":5},160,{"$nulls":4},161,{"$nulls":4},162,163,null,164,{"$nulls":3},165,166,{"$nulls":3},167,null,null,168,169,170,171,172,{"$nulls":5},173,null,174,null,175,176,{"$nulls":6},177,178,null,179,180,181,182,183,184,185,186,187,188,189,190,191,{"$nulls":8},192,193,{"$nulls":8},194,195,196,null,197,null,198,null,199,{"$nulls":7},200]
[{"$nulls":3},"空調",{"$nulls":3},"室内温度の設定の規定",null,null,"クールビズ・ウォームビズの実施","照明",{"$nulls":5},"分別廃棄",null,"グリーン購入","家具の買替えサイクル規程",null,"ペーパレスへの取組み",{"$nulls":5},"会議室の設置",{"$nulls":4},"会議室の設備",{"$nulls":4},"会議室の占有面積","受付",null,"ロビー",{"$nulls":3},"ロビーの占有面積（受付スペース含む）","接客設備",{"$nulls":3},"応接室の設備",null,null,"応接室の占有面積","リフレッシュスペースの有無","リフレッシュスペースの種類","リフレッシュスペースの大きさ","リフレッシュスペースの設備",{"$nulls":5},"喫煙設備",null,"排煙対策",null,"サーバー室面積","その他",{"$nulls":6},"セキュリティに関する基本方針が文書化され組織全体で共有されている","セキュリティに関する管理組織がある。","「YES」と回答された方は、その具体的な役割をご記入ください","外部委託先と秘密保持の契約を締結している","従業員と秘密保持に関する契約書を締結している","セキュリティに関する従業員教育を実施している","書類やその他資産の重要度に応じて分類し、管理している","重要書類の取扱い・持ち出しのルールがあり、遵守されている","重要書類の廃棄のルールがあり、遵守されている","モバイルＰＣの持ち出しのルールがあり、遵守されている","モバイルＰＣの廃棄のルールがあり、遵守されている","電子媒体の持ち出しのルールがあり、遵守されている","電子媒体の廃棄のルールがあり、遵守されている","セキュリティレベルに応じてオフィスを明確に区分している","オフィスの設計図が、継続的に更新されており、管理されている","入退室管理を実施している",{"$nulls":8},"入退室におけるアクセス記録をとっている","保管庫・キャビネット等の施錠ついて、保管・保存する書類等の",{"$nulls":8},"保管庫・キャビネット等のアクセス記録をとっている","収納家具の地震対策を行っている","コピー機、ＦＡＸ機、プリンタ等の出力機器に対してセキュリテイ対策を実施している。","「YES」と回答された方は、その内容を具体的にご記入ください","地震、水害、火災等の非常時を想定したスペース及び避難ルートの確保、設備対策、備品保存等が行われている。","「YES」と回答された方は、その内容を具体的にご記入ください","重大な犯罪・テロ対策について対策を行っている","「YES」と回答された方は、その内容を具体的にご記入ください","情報システムにおけるセキュリティ対策を実施している",{"$nulls":7},"事業継続管理を行っている"]
["書式4.設問152-200",null,null,"ゾーン制御可能","窓開閉可能","その他","その他",null,"夏季","冬季",null,"ゾーン制御","人感センサー付","昼光利用制御","高効率照明器具","その他","その他",null,"分別の種類",null,null,"その他","プリントアウトの制限","コピーの制限","収納家具の削減","ペーパーの再利用","その他","その他","集中して設置","各フロアに分散して設置","部門に付帯して設置","その他","その他","ＡＶ会議室","TV会議室","コピーボード","その他","その他",null,null,"その他","待合スペース","商談スペース","その他","その他",null,"応接室","商談コーナー","その他","その他","応接セット","チェア＋テーブル","プレゼンテーション設備",{"$nulls":4},"チェアのみ","チェアとテーブル","自販機設置","カフェ設備","その他","その他",null,"その他",null,"その他",null,"倉庫","ロッカー室","休養室","シャワー室","食堂","その他","その他",{"$nulls":15},"鍵－機械鍵方式","鍵－ダイヤル方式","鍵－テンキー方式","鍵－カード方式","鍵－生体認証方式","人－受付","人－ガードマン","その他","その他",null,"鍵－機械鍵方式","鍵－ダイヤル方式","鍵－テンキー方式","鍵－カード方式","鍵－生体認証方式","人－受付","人－ガードマン","その他","その他",{"$nulls":8},"データのバックアップ対策","設備の２重化対策","ウイルス対策","アクセス制御","ログ管理","電磁シールド","その他","その他",null,"「YES」と回答された方は、その内容を具体的にご記入ください"]
["ファイル名","日付","ユニーク値",{"$f":"D3&\"/\"&D4&\"/\"&D5","v":"152/空調/ゾーン制御可能"},{"$f":"E3&\"/\"&E4&\"/\"&E5","v":"//窓開閉可能"},"//その他","//その他","153/室内温度の設定の規定/","//夏季","//冬季","154/クールビズ・ウォームビズの実施/","155/照明/ゾーン制御","//人感センサー付","//昼光利用制御","//高効率照明器具","//その他","//その他","156/分別廃棄/","//分別の種類","157/グリーン購入/","158/家具の買替えサイクル規程/","//その他","159/ペーパレスへの取組み/プリントアウトの制限","//コピーの制限","//収納家具の削減","//ペーパーの再利用","//その他","//その他","160/会議室の設置/集中して設置","//各フロアに分散して設置","//部門に付帯して設置","//その他","//その他","161/会議室の設備/ＡＶ会議室","//TV会議室","//コピーボード","//その他","//その他","162/会議室の占有面積/","163/受付/","//その他","164/ロビー/待合スペース","//商談スペース","//その他","//その他","165/ロビーの占有面積（受付スペース含む）/","166/接客設備/応接室","//商談コーナー","//その他","//その他","167/応接室の設備/応接セット","//チェア＋テーブル","//プレゼンテーション設備","168/応接室の占有面積/","169/リフレッシュスペースの有無/","170/リフレッシュスペースの種類/","171/リフレッシュスペースの大きさ/","172/リフレッシュスペースの設備/チェアのみ","//チェアとテーブル","//自販機設置","//カフェ設備","//その他","//その他","173/喫煙設備/","//その他",{"$f":"BN3&\"/\"&BN4&\"/\"&BN5","v":"174/排煙対策/"},"//その他","175/サーバー室面積/","176/その他/倉庫","//ロッカー室","//休養室","//シャワー室","//食堂","//その他","//その他","177/セキュリティに関する基本方針が文書化され組織全体で共有されている/","178/セキュリティに関する管理組織がある。/","/「YES」と回答された方は、その具体的な役割をご記入ください/","179/外部委託先と秘密保持の契約を締結している/","180/従業員と秘密保持に関する契約書を締結している/","181/セキュリティに関する従業員教育を実施している/","182/書類やその他資産の重要度に応じて分類し、管理している/","183/重要書類の取扱い・持ち出しのルールがあり、遵守されている/","184/重要書類の廃棄のルールがあり、遵守されている/","185/モバイルＰＣの持ち出しのルールがあり、遵守されている/","186/モバイルＰＣの廃棄のルールがあり、遵守されている/","187/電子媒体の持ち出しのルールがあり、遵守されている/","188/電子媒体の廃棄のルールがあり、遵守されている/","189/セキュリティレベルに応じてオフィスを明確に区分している/","190/オフィスの設計図が、継続的に更新されており、管理されている/","191/入退室管理を実施している/鍵－機械鍵方式","//鍵－ダイヤル方式","//鍵－テンキー方式","//鍵－カード方式","//鍵－生体認証方式","//人－受付","//人－ガードマン","//その他","//その他","192/入退室におけるアクセス記録をとっている/","193/保管庫・キャビネット等の施錠ついて、保管・保存する書類等の/鍵－機械鍵方式","//鍵－ダイヤル方式","//鍵－テンキー方式","//鍵－カード方式","//鍵－生体認証方式","//人－受付","//人－ガードマン","//その他","//その他","194/保管庫・キャビネット等のアクセス記録をとっている/","195/収納家具の地震対策を行っている/","196/コピー機、ＦＡＸ機、プリンタ等の出力機器に対してセキュリテイ対策を実施している。/","/「YES」と回答された方は、その内容を具体的にご記入ください/","197/地震、水害、火災等の非常時を想定したスペース及び避難ルートの確保、設備対策、備品保存等が行われている。/","/「YES」と回答された方は、その内容を具体的にご記入ください/","198/重大な犯罪・テロ対策について対策を行っている/","/「YES」と回答された方は、その内容を具体的にご記入ください/","199/情報システムにおけるセキュリティ対策を実施している/データのバックアップ対策","//設備の２重化対策","//ウイルス対策","//アクセス制御","//ログ管理","//電磁シールド","//その他","//その他","200/事業継続管理を行っている/",{"$f":"DW3&\"/\"&DW4&\"/\"&DW5","v":"//「YES」と回答された方は、その内容を具体的にご記入ください"}]
{"$rows_left_out":14}
{"sheet":"list","index":8,"n_rows":103,"n_cols":32,"rows_kept":103,"hidden":true,"merged":[[1,22,1,23]]}
[]
[{"$nulls":6},"ビルの階数",null,null,"地下",{"$nulls":3},"リスト",null,"プルダウン用","データ用",{"$nulls":5},"建物"]
[{"$nulls":5},0,"選択してください",null,0,"選択してください",{"$nulls":3},"都道府県",null,"年","年",null,"月",{"$nulls":3},"年","月"]
[{"$nulls":5},1,1,null,1,"なし",null,null,0,"選択してください",1,"選択","選択",1,"選択",{"$nulls":3},0,0,null,0,"選択してください",null,1,"上場"]
[{"$nulls":5},2,2,null,2,1,null,null,1,"北海道",2,2022,2022,2,1,{"$nulls":3},1,1,null,1,"水産",null,2,"未上場"]
[{"$nulls":5},3,3,null,3,2,null,null,2,"青森県",3,2021,2021,3,2,{"$nulls":3},2,2,null,2,"鉱業",null,3,"該当無し（企業以外）"]
{"$rows_left_out":98}
{"sheet":"Sheet3","index":9,"n_rows":0,"n_cols":0,"rows_kept":0,"hidden":true}

{"sheet":"Sheet4","index":10,"n_rows":0,"n_cols":0,"rows_kept":0,"hidden":true}