{"text_format":"3","workbook":"xlsx","n_sheets":11,"sheets":["表紙","書式1","書式3","承諾書","応募オフィス名称確認書","Record1","処理中","Record3","list","Sheet3","Sheet4"],"not_rendered":{"images":8,"macros":1,"external_links":2,"defined_names":30},"read":"whole","date_system":"1900"}

{"sheet":"表紙","index":0,"n_rows":102,"n_cols":1,"rows_kept":102,"merged":[[6,2,6,10],[9,5,9,7]]}
{"$rows_empty":101}
["応募"]

{"sheet":"書式1","index":1,"n_rows":132,"n_cols":8,"rows_kept":132,"merged":[[0,1,0,4],[1,2,1,4],[4,1,4,2],[4,3,4,4],[5,3,5,4],[6,3,6,4],[7,3,7,4],[10,3,10,4],[11,3,11,4],[12,3,12,4],[15,3,15,4],[16,3,16,4],[18,1,18,2],[22,3,22,4],[23,3,23,4],[26,3,26,4],[27,3,27,4],[28,3,28,4],[32,1,32,2],[32,3,32,4],[34,1,34,2],[34,3,34,4],[37,3,38,4],[39,3,39,4],[40,3,43,4],[44,3,44,4],[47,3,47,4],[48,3,48,4],[49,3,49,4],[50,3,50,4],[51,3,51,4],[52,3,52,4],[53,3,53,4],[54,3,54,4],[55,3,55,4],[57,3,57,4],[58,3,58,4],[59,3,59,4],[60,3,60,4],[61,3,61,4],[62,3,62,4],[63,3,63,4],[64,3,64,4],[65,3,65,4],[66,3,66,4],[67,3,67,4],[69,1,75,1],[69,3,69,4],[70,3,70,4],[71,3,71,4],[75,3,75,4],[77,3,77,4],[78,3,78,4],[79,3,79,4],[80,1,80,2],[80,3,80,4],[81,1,87,1],[81,3,81,4],[82,3,82,4],[83,3,83,4],[87,3,87,4],[89,3,89,4],[90,3,90,4],[91,3,91,4],[92,1,92,2],[92,3,92,4],[93,1,99,1],[93,3,93,4],[94,3,94,4],[95,3,95,4],[99,3,99,4],[101,3,101,4],[102,3,102,4],[103,3,103,4],[104,1,104,2],[104,3,104,4],[106,3,106,4],[108,3,108,4],[110,1,110,2],[111,1,111,2],[112,1,112,2],[113,1,113,2],[115,1,115,2],[115,3,115,4],[119,3,119,4],[122,1,124,1],[122,3,122,4],[123,3,123,4],[126,1,126,2]]}
[null,"※応募受付完了後に応募者からの依頼による応募書類記載内容の変更はできません。 \n記載漏れ、間違いがないか確認の上、アップロードしてください。"]
[null,"1｜応募プロフィール"]
[]
[null,"応募企業・団体",null,"必要事項を記入し、該当する個所を選択してください。"]
[null,"企業・団体名（代表企業・団体）",{"$nulls":5},"記述（内容40字以内）"]
[null,"（英文字）",{"$nulls":5},"記述（内容40字以内）"]
[null,"URL",{"$nulls":5},"記述（内容40字以内）"]
[null,null,"URL確認欄［①］",{"$f":"+IF(D7=\"\",\"\",IF(LEFT(D7,7)=\"http://\",ASC(D7),IF(LEFT(D7,8)=\"https://\",ASC(D7),\"http://\"&ASC(D7))))","v":""}]
[null,"本社所在地","〒",null,"（例：123-4567）",null,null,"記述"]
[null,null,"都道府県",null,null,{"$f":"+Record1!J8","v":0},null,"選択"]
[null,null,"市区町村番地",{"$nulls":4},"記述（内容40字以内）"]
[null,null,"建物名",{"$nulls":4},"記述（内容40字以内）"]
[null,null,"本社所在地表示確認欄［②③④］",{"$f":"+IF(Record1!J8=0,\"\",Record1!I8)&D11&D12","v":""}]
[null,null,"電話",null,"（例：03-1234-5678）",null,null,"記述"]
[null,null,"FAX",null,"（例：03-1234-5678）",null,null,"記述"]
[null,"代表者名","役職名",{"$nulls":4},"記述（内容40字以内）"]
[null,null,"代表者氏名",{"$nulls":4},"記述（内容40字以内）"]
[null,"資本金・出資金",null,null,"円",null,null,"記述"]
[null,"応募時点の全従業員数\n(正規雇用・非正規雇用・受入出向・派遣社員を含む）",null,null,"名",null,null,"記述"]
[null,"業種",{"$nulls":3},{"$f":"+Record1!U8","v":0},null,"選択"]
[null,"上場",{"$nulls":3},{"$f":"+Record1!W8","v":0},null,"選択"]
[null,"応募オフィス"]
[null,"応募オフィス名称",{"$nulls":5},"記述（内容65字以内）"]
[null,"※必ず記入要領を参照してください。","フリガナ",{"$nulls":4},"記述（内容80字以内）"]
[null,"応募オフィス所在地","〒",null,"（例：123-4567）",null,null,"記述"]
[null,null,"都道府県",null,null,{"$f":"+Record1!AB8","v":0},null,"選択"]
[null,null,"市区町村番地",{"$nulls":4},"記述（内容40字以内）"]
[null,null,"建物名",{"$nulls":4},"記述（内容40字以内）"]
[null,null,"応募オフィス所在地表示確認欄［⑤⑥⑦］",{"$f":"+IF(Record1!AB8=0,\"\",Record1!AA8)&D27&D28","v":""}]
[null,"建物の規模","地上",null,null,{"$f":"+Record1!AF8","v":0},null,"選択"]
[null,null,"地下",null,null,{"$f":"+Record1!AI8","v":0},null,"選択"]
[null,"応募企業・団体の入居",{"$nulls":3},{"$f":"+Record1!AK8","v":0},null,"選択"]
[null,"「建物の部分」の場合は、階を記入→",{"$nulls":5},"記述"]
[null,"応募オフィスの範囲",{"$nulls":3},{"$f":"+Record1!AN8","v":0},null,"選択"]
[null,"応募オフィスの範囲が、上記のＡ）またはＢ）の\n一部分の場合は、特定した理由と、その階を記入→",{"$nulls":5},"記述（内容40字以内）"]
[null,"建物の築年数",{"$nulls":3},{"$f":"+Record1!AP8+Record1!AQ8","v":0},null,"記述"]
[null,"応募オフィスの延床面積",null,null,"㎡",null,null,"記述"]
[null,"応募オフィスの種類",{"$nulls":3},{"$f":"+Record1!AZ8","v":""},null,"複数選択"]
[null,"（複数回答可）",{"$nulls":5},"　〃"]
[null,null,"その他",null,null,{"$f":"+IF(Record1!AY9,1,0)","v":0},null,"記述（内容40字以内）"]
[null,"応募オフィスの主たる業務",{"$nulls":3},{"$f":"+Record1!BI8","v":""},null,"複数選択"]
[{"$nulls":7},"　〃"]
[null,"（複数回答可）",{"$nulls":5},"　〃"]
[{"$nulls":7},"　〃"]
[null,null,"その他",null,null,{"$f":"+IF(Record1!BH9,1,0)","v":0},null,"記述（内容40字以内）"]
[null,"応募オフィスの従業員数",null,null,"人",null,null,"記述"]
[null,"オフィス"]
[null,"応募オフィスの企画者・部門 社内",{"$nulls":5},"記述（内容40字以内）"]
[null,"　　　〃　　　　 設計者・部門 社内",{"$nulls":5},"記述（内容40字以内）"]
[null,"　　　〃　　　　 施工者・部門 社内",{"$nulls":5},"記述（内容40字以内）"]
[null,"応募オフィスの企画者・部門 社外",{"$nulls":5},"記述（内容40字以内）"]
[null,"　　　〃　　　　 設計者・部門 社外",{"$nulls":5},"記述（内容40字以内）"]
[null,"　　　〃　　　　 施工者・部門 社外",{"$nulls":5},"記述（内容40字以内）"]
[null,"オフィス内装の区分",{"$nulls":3},{"$f":"+Record1!BS8","v":0},null,"選択"]
[null,"オフィス家具の区分",{"$nulls":3},{"$f":"+Record1!BU8","v":0},null,"選択"]
[null,"オフィス機器の区分",{"$nulls":3},{"$f":"+Record1!BW8","v":0},null,"選択"]
[null,"応募オフィスの建物"]
[null,"建物の所有形態",{"$nulls":3},{"$f":"+Record1!BY8","v":0},null,"選択"]
[null,"建物の入居状況",{"$nulls":3},{"$f":"+Record1!CA8","v":0},null,"選択"]
[null,"建物の企画者・部門 社内",{"$nulls":5},"記述（内容40字以内）"]
[null," 〃  の設計者・部門 社内",{"$nulls":5},"記述（内容40字以内）"]
[null," 〃  の工事者・部門 社内",{"$nulls":5},"記述（内容40字以内）"]
[null,"建物の企画者・部門 社外",{"$nulls":5},"記述（内容40字以内）"]
[null," 〃  の設計者・部門 社外",{"$nulls":5},"記述（内容40字以内）"]
[null," 〃  の工事者・部門 社外",{"$nulls":5},"記述（内容40字以内）"]
[null,"使用開始までのプロセス","建物の施工",null,null,{"$f":"IF(AND(Record1!CH9<>1,Record1!CH10<>1,Record1!CH11<>1,Record1!CH12<>1),Record1!CH8,0)","v":0},null,{"$f":"IF(OR(AND(Record1!CH13<>\"選択\",Record1!CH13>=2022,Record1!CH14<>\"選択\",Record1!CH14>=4),AND(Record1!CH15<>\"選択\",Record1!CH15>=2022,Record1!CH16<>\"選択\",Record1!CH16>=4)),\"2022年3月以前の日付を選択してください\",\"選択\")","v":"選択"}]
[null,null,"オフィスの施工",null,null,{"$f":"IF(AND(Record1!CK9<>1,Record1!CK10<>1,Record1!CK11<>1,Record1!CK12<>1),Record1!CK8,0)","v":0},null,{"$f":"IF(OR(AND(Record1!CK13<>\"選択\",Record1!CK13>=2022,Record1!CK14<>\"選択\",Record1!CK14>=4),AND(Record1!CK15<>\"選択\",Record1!CK15>=2022,Record1!CK16<>\"選択\",Record1!CK16>=4)),\"2022年3月以前の日付を選択してください\",\"選択\")","v":"選択"}]
[null,null,"使用開始",null,null,{"$f":"IF(AND(Record1!CN9<>1,Record1!CN10<>1),Record1!CN8,0)","v":0},null,{"$f":"IF(AND(Record1!CN13<>\"選択\",Record1!CN13>=2022,Record1!CN14<>\"選択\",Record1!CN14>=4),\"2022年3月以前の日付を選択してください\",\"選択\")","v":"選択"}]
[null,"応募責任者・担当者"]
[null,"応募責任者　　【必須】\n応募全体に責任をもつ方\n\n社外の人でなく、必ず、応募企業・団体の中から選出してください。","氏名",{"$nulls":4},"記述（内容40字以内）"]
[null,null,"所属",{"$nulls":4},"記述（内容40字以内）"]
[null,null,"役職",{"$nulls":4},"記述（内容40字以内）"]
[null,null,"電話",null,"（例：03-1234-5678）",null,null,"記述"]
[null,null,"携帯電話",null,"（例：090-1234-5678）",null,null,"記述"]
[null,null,"FAX",null,"（例：03-1234-5678）",null,null,"記述"]
[null,null,"Eメール",{"$nulls":4},"記述（内容40字以内）"]
[null,"応募責任者の所在地","〒",null,"（例：123-4567）",null,null,"記述"]
[null,null,"都道府県",null,null,{"$f":"+Record1!CY8","v":0},null,"選択"]
[null,null,"市区町村番地",{"$nulls":4},"記述（内容40字以内）"]
[null,null,"建物名",{"$nulls":4},"記述（内容40字以内）"]
[null,"応募責任者住所表示確認欄［⑩⑪⑫］",null,{"$f":"IF(F78=0,\"\",Record1!CX8)&書式1!D79&書式1!D80","v":""}]
[null,"応募担当者　　【必須】\n連絡窓口となって頂ける方\n応募後の連絡が必ず通じる方\n\n社外の人でなく、必ず、応募企業・団体の中から選出してください。","氏名",{"$nulls":4},"記述（内容40字以内）"]
[null,null,"所属",{"$nulls":4},"記述（内容40字以内）"]
[null,null,"役職",{"$nulls":4},"記述（内容40字以内）"]
[null,null,"電話",null,"（例：03-1234-5678）",null,null,"記述"]
[null,null,"携帯電話",null,"（例：090-1234-5678）",null,null,"記述"]
[null,null,"FAX",null,"（例：03-1234-5678）",null,null,"記述"]
[null,null,"Eメール",{"$nulls":4},"記述（内容40字以内）"]
[null,"応募担当者の所在地","〒",null,"（例：123-4567）",null,null,"記述"]
[null,null,"都道府県",null,null,{"$f":"+Record1!DL8","v":0},null,"選択"]
[null,null,"市区町村番地",{"$nulls":4},"記述（内容40字以内）"]
[null,null,"建物名",{"$nulls":4},"記述（内容40字以内）"]
[null,"応募担当者住所表示確認欄[⑬⑭⑮]",null,{"$f":"+IF(F90=0,\"\",Record1!DK8)&書式1!D91&書式1!D92","v":""}]
[null,"応募担当補佐　　【任意】\n応募後の連絡が「応募担当者」と同様に通じる方\n\n※「応募担当者」の連絡が通じ難い場合は、「担当補佐」の記入を併せてお願いします\n\n社外の人でなく、必ず、応募企業・団体の中から選出してください。\n","氏名",{"$nulls":4},"記述（内容40字以内）"]
[null,null,"所属",{"$nulls":4},"記述（内容40字以内）"]
[null,null,"役職",{"$nulls":4},"記述（内容40字以内）"]
[null,null,"電話",null,"（例：03-1234-5678）",null,null,"記述"]
[null,null,"携帯電話",null,"（例：090-1234-5678）",null,null,"記述"]
[null,null,"FAX",null,"（例：03-1234-5678）",null,null,"記述"]
[null,null,"Eメール",{"$nulls":4},"記述（内容40字以内）"]
[null,"応募担当補佐の所在地","〒",null,"（例：123-4567）",null,null,"記述"]
[null,null,"都道府県",null,null,{"$f":"+Record1!DY8","v":0},null,"選択"]
[null,null,"市区町村番地",{"$nulls":4},"記述（内容40字以内）"]
[null,null,"建物名",{"$nulls":4},"記述（内容40字以内）"]
[null,"応募担当補佐住所表示確認欄[⑯⑰⑱]",null,{"$f":"+IF(F102=0,\"\",Record1!DX8)&書式1!D103&書式1!D104","v":""}]
[null,"オフィスのデータ"]
[null,"応募オフィスの延床面積[⑧]",null,{"$f":"+FIXED(D37,0)&E37","v":"0㎡"},{"$nulls":3},"記述"]
[null,"オフィス構築の総費用",null,null,"千円",null,null,"記述"]
[null,"(内訳）"]
[null,"(内訳）　　企画・設計費",null,null,"%",null,null,"記述"]
[null,"　　　　　　内装費",null,null,"%",null,null,"記述"]
[null,"　　　　　　オフィス家具（施工含む）",null,null,"%",null,null,"記述"]
[null,"　　　　　　オフィス機器（施工含む）",null,null,"%",null,null,"記述"]
[null,"　　　　　　その他（引越し費用等）",null,null,"%",null,null,"記述"]
[null,null,"%計",{"$f":"+IF(SUM(D110:D114)<>100,\"合計が１００％になっていません\",100)","v":"合計が１００％になっていません"},{"$f":"+IF(D115=100,\"%\",\"\")","v":""}]
[null,"応募オフィスの従業員数［⑨］",null,{"$f":"+FIXED(D46,0)&E46","v":"0人"},{"$nulls":3},"記述"]
[null,"天井高さ（床仕上げ面から）",null,null,"mm（ミリメートル）",null,null,"記述"]
[null,"一般執務スペース",null,null,"㎡",null,null,"記述"]
[null,"執務用総席数",null,null,"席",null,null,"記述"]
[null,"主なオフィスの運用方式",{"$nulls":3},{"$f":"+Record1!EP8","v":0},null,"選択"]
[null,"共有書類の総収容可能量",null,null,"fm（ファイルメーター）",null,null,"記述"]
[null,"個人の書類等の収容量",null,null,"fm/人",null,null,"記述"]
[null,"オフィスづくりやオフィスの運用に関する調査の実施","企画・設計時",null,null,{"$f":"+Record1!ET8","v":0},null,"選択"]
[null,null,"使用開始時",null,null,{"$f":"+Record1!EV8","v":0},null,"選択"]
[null,null,"定期的",null,"回",null,null,"記述"]
[null,"オフィスの建物のデータ"]
[null,"延床面積\n自社ビルの場合記入する。オフィスビル内に駐車場があるときにはそれも含めてください。",null,null,"㎡",null,null,"記述"]
[null,"建物の総費用\n自社ビルの場合記入する。",null,null,"百万円",null,null,"記述"]
[null,"（内訳）"]
[null,"(内訳) 　　企画・設計費",null,null,"%",null,null,"記述"]
[null,"　　　　　　工事費",null,null,"%",null,null,"記述"]
[null,null,"%計",{"$f":"+IF(F58<>1,\"\",IF(SUM(D130:D131)<>100,\"合計が１００％になっていません\",100))","v":""},{"$f":"+IF(D132=100,\"%\",\"\")","v":""}]

{"sheet":"書式3","index":2,"n_rows":373,"n_cols":2,"rows_kept":373,"hidden":true,"merged":[[3,1,3,9],[321,1,321,9],[372,1,372,9]]}
[]
[null,"3｜施設・空間の概要"]
[]
[null,"１． オフィスの概要がわかる写真を貼付してください。（カラー写真）\n２． 写真は、枚数および大きさは問いませんが書式３－１から書式３－６に収めてください。\n３． すべての写真にはスペース名と簡単な説明を付けてください。\n４． 受付、ロビー、エントランス、一般執務スペース、リフレッシュエリア、会議室、応接室の写真は必ず入れてください。（一般執務スペースの写真は、仕事をしているオフィスワーカーが写っているものに限ります。）"]
{"$rows_empty":317}
[null,"「レイアウト図（図面）」\nオフィス全体が分かるレイアウト図を貼付し、動線、レイアウト、空間などの使い方について、簡潔に説明を加えてください（図中に基準寸法または全体寸法を表示してください）。"]
{"$rows_empty":50}
[null,"「レイアウト図（図面)」\n一般執務スペース等のレイアウト図を貼付し、動線、レイアウト、空間などの使い方について、簡潔に説明を加えてください（図中に基準寸法または全体寸法を表示してください）。"]

{"sheet":"承諾書","index":3,"n_rows":4,"n_cols":6,"rows_kept":4,"merged":[[5,4,5,5],[11,2,11,5],[13,2,13,5],[14,2,14,5],[15,2,15,5],[16,2,16,5],[18,4,18,5],[19,4,19,5],[21,3,21,5],[22,3,22,5],[23,4,23,5],[24,4,24,5],[25,3,25,5],[26,3,26,5],[27,3,27,5],[30,2,30,5],[33,2,35,5],[37,2,37,5],[47,2,47,5]]}
[]
[]
[]
[{"$nulls":5}," 応募番号："]

{"sheet":"応募オフィス名称確認書","index":4,"n_rows":89,"n_cols":22,"rows_kept":89,"merged":[[9,2,16,21],[20,2,21,21],[23,2,23,21],[27,2,29,21],[50,2,60,21],[61,2,68,21],[70,2,75,21],[81,2,81,21]]}
[]
[]
[{"$nulls":13}," 応募番号："]
[null,null,"応募者各位"]
[{"$nulls":21},"一般社団法人ニューオフィス推進協会"]
[{"$nulls":21},"日経ニューオフィス賞本部事務局"]
[]
[{"$nulls":8},"応募オフィス名称確認書"]
[]
[null,null,"『応募オフィス名称』のご記入をお願い致します。\n同一名称で記入欄１、２の記入が必要です。承諾書と併せてご提出ください。\n\n『応募オフィス名称』は受賞の際、新聞、ＮＯＰＡホームページ等で使用する正式名称となります。\n『応募オフィス名称』に記載された内容が審査対象になります。それ以外のスペースは審査対象外です。\nなお、募集要綱の審査方法に記載がありますように「必要に応じて行われる現地審査」の際に『応募オフィス名称』と応募範囲の確認を行います。"]
{"$rows_empty":8}
[null,null,"■『応募オフィス名称』記入欄１"]
[]
[null,null,"＊書式１、2、3の『応募オフィス名称』と相違がある場合は応募オフィス名称確認書の『応募オフィス名称』\nが正となります。"]
[]
[]
[]
[]
[null,null,"■『応募オフィス名称』記入欄２"]
[]
[null,null,"＊記入欄１の内容を左上より１文字ずつ記入する。\n＊全角が基本です。半角は記入マスの上部に・を付けて明確にしてください。”スペース”は空欄を入れる。"]
{"$rows_empty":12}
[{"$nulls":16},"年　　　月　　　　日　"]
[{"$nulls":3},"企　業　名："]
[]
[{"$nulls":3},"応募責任者：",{"$nulls":15},"社印"]
[]
[null,null,"＊　上記フォームご記入の上、承諾書、画像データと合せて送付してください。"]
[]
[]
[null,null,"■『応募オフィス名称』について"]
[]
[null,null,"・企業・団体の名称、通称、略称に、“オフィス”、または、“ビル”等の文言を入れた名称にしてください。\n　（例： 〇〇オフィス、〇〇本社ビル、〇〇 ××研究所、〇〇 △△センター）\n　“〇〇”は企業・団体の名称、通称、略称の意味\n　①企業名、団体名のみの名称は、応募名称として受付いたしかねます。\n　②応募オフィスの入居範囲が賃貸ビルの一部の場合は「〇〇本社ビル」という名称は受付いたしかねます。\n　③また、自社ビル、賃貸ビルに関わらず、応募オフィスの範囲が入居範囲の一部の場合は「〇〇オフィス\n       ××階」と記入ください。\n　④法人格（株式会社、(株)などの文言）の記載は不要です。"]
{"$rows_empty":10}
[null,null,"・応募オフィスが入居範囲の一部場合のフロア（階）の記入方法\n　①連続する場合、数字は半角文字、最初と最後の階を半角“-”(ハイフン）でつなぎ記入ください。\n　例 　1階、2階、3階 の場合： 1-3階（またはF）\n　②連続しない場合、連続しない階数の間は半角”,”(カンマ）でつなぎ、全フロアを記入ください。\n　例　「1階、10階、11階」の場合： 1,10-11階（またはF)\n　③階の一部分である場合 具体的な対象範囲を記入ください。 (”側”は省略)\n　例 　「 5階東側」の場合： 5階東"]
{"$rows_empty":8}
[null,null,"・使用する全角と半角文字の記入方法\n　①全角を使用する文字：\n　日本語（漢字、平仮名、カタカナ）」、「日本語（漢字、平仮名、カタカナ）間の”スペース”」\n　②半角を使用する文字：\n　「英文字、数字」「英文字、数字間の”スペース”」「英数字と日本語間の”スペース”」"]
[]
[]
[]
[]
[]
[]
[null,null,"■『応募オフィス名称』記入例"]
[]
[{"$nulls":3},"記入欄１"]
[]
[null,null,"カーボンゼロ電力 Innovation Lab 2-4階"]
[]
[{"$nulls":3},"記入欄２"]
[]
[{"$nulls":10},"・","・","・","・","・","・","・","・","・","・","・","・"]
[null,null,"カ","―","ボ","ン","ゼ","ロ","電","力",null,"I","ｎ","ｎ","ｏ","ｖ","ａ","t","ｉ","ｏ","ｎ"]
[null,null,"・","・","・","・","・","・","・"]
[null,null,"L","ａ","ｂ",null,2,"-",4,"階"]

{"sheet":"Record1","index":5,"n_rows":42,"n_cols":159,"rows_kept":42,"hidden":true}
[{"$f":"CELL(\"filename\")","v":"C:\\Users\\渡邉亜実\\Desktop\\02 block変換\\202205test\\[35th_entry.xlsm]表紙"},null,null,5,6,7,8,9,10,10,11,12,13,14,15,16,17,18,19,20,20,21,21,23,24,25,26,26,27,28,29,30,30,31,31,32,32,33,34,34,35,36,36,37,38,38,38,38,38,38,38,38,40,41,41,41,41,41,41,41,41,45,46,48,49,50,51,52,53,54,54,55,55,56,56,58,58,59,59,60,61,62,63,64,65,66,66,66,67,67,67,68,68,70,71,72,73,74,75,76,77,78,78,79,80,81,82,83,84,85,86,87,88,89,90,90,91,92,93,94,95,96,97,98,99,100,101,102,102,103,104,105,107,108,110,111,112,113,114,115,116,117,118,119,120,120,121,122,123,123,124,124,125,127,128,130,131,132,"END"]
[{"$f":"FIND(\"[\",A1,1)","v":45},null,null,{"$f":"IF(INDIRECT(\"書式1!\"&\"B\"&D1)=\"\",\"\",INDIRECT(\"書式1!\"&\"B\"&D1))","v":"企業・団体名（代表企業・団体）"},"（英文字）","URL","","本社所在地","","","","","","","","代表者名","","資本金・出資金","応募時点の全従業員数\n(正規雇用・非正規雇用・受入出向・派遣社員を含む）","業種","業種","上場","上場","応募オフィス名称","※必ず記入要領を参照してください。","応募オフィス所在地","","","","","","建物の規模",{"$f":"IF(INDIRECT(\"書式1!\"&\"B\"&AG1)=\"\",\"\",INDIRECT(\"書式1!\"&\"B\"&AG1))","v":"建物の規模"},"","","応募企業・団体の入居",{"$f":"IF(INDIRECT(\"書式1!\"&\"B\"&AK1)=\"\",\"\",INDIRECT(\"書式1!\"&\"B\"&AK1))","v":"応募企業・団体の入居"},"「建物の部分」の場合は、階を記入→","応募オフィスの範囲","応募オフィスの範囲",{"$f":"IF(INDIRECT(\"書式1!\"&\"B\"&AO1)=\"\",\"\",INDIRECT(\"書式1!\"&\"B\"&AO1))","v":"応募オフィスの範囲が、上記のＡ）またはＢ）の\n一部分の場合は、特定した理由と、その階を記入→"},"建物の築年数","建物の築年数","応募オフィスの延床面積","応募オフィスの種類","応募オフィスの種類","応募オフィスの種類","応募オフィスの種類","応募オフィスの種類","応募オフィスの種類","応募オフィスの種類","応募オフィスの種類","","応募オフィスの主たる業務","応募オフィスの主たる業務","応募オフィスの主たる業務","応募オフィスの主たる業務","応募オフィスの主たる業務","応募オフィスの主たる業務","応募オフィスの主たる業務","応募オフィスの主たる業務","","応募オフィスの従業員数","応募オフィスの企画者・部門 社内","　　　〃　　　　 設計者・部門 社内","　　　〃　　　　 施工者・部門 社内","応募オフィスの企画者・部門 社外","　　　〃　　　　 設計者・部門 社外","　　　〃　　　　 施工者・部門 社外",{"$f":"IF(INDIRECT(\"書式1!\"&\"B\"&BR1)=\"\",\"\",INDIRECT(\"書式1!\"&\"B\"&BR1))","v":"オフィス内装の区分"},"オフィス内装の区分","オフィス家具の区分","オフィス家具の区分","オフィス機器の区分","オフィス機器の区分","建物の所有形態","建物の所有形態","建物の入居状況","建物の入居状況","建物の企画者・部門 社内"," 〃  の設計者・部門 社内"," 〃  の工事者・部門 社内","建物の企画者・部門 社外"," 〃  の設計者・部門 社外"," 〃  の工事者・部門 社外","使用開始までのプロセス","使用開始までのプロセス","使用開始までのプロセス","","","","","","応募責任者　　【必須】\n応募全体に責任をもつ方\n\n社外の人でなく、必ず、応募企業・団体の中から選出してください。","",{"$f":"IF(INDIRECT(\"書式1!\"&\"B\"&CR1)=\"\",\"\",INDIRECT(\"書式1!\"&\"B\"&CR1))","v":""},"","","","","応募責任者の所在地","",{"$f":"IF(INDIRECT(\"書式1!\"&\"B\"&CY1)=\"\",\"\",INDIRECT(\"書式1!\"&\"B\"&CY1))","v":""},"","","応募責任者住所表示確認欄［⑩⑪⑫］","応募担当者　　【必須】\n連絡窓口となって頂ける方\n応募後の連絡が必ず通じる方\n\n社外の人でなく、必ず、応募企業・団体の中から選出してください。","",{"$f":"IF(INDIRECT(\"書式1!\"&\"B\"&DE1)=\"\",\"\",INDIRECT(\"書式1!\"&\"B\"&DE1))","v":""},"","","","","応募担当者の所在地","","","","","応募担当者住所表示確認欄[⑬⑭⑮]","応募担当補佐　　【任意】\n応募後の連絡が「応募担当者」と同様に通じる方\n\n※「応募担当者」の連絡が通じ難い場合は、「担当補佐」の記入を併せてお願いします\n\n社外の人でなく、必ず、応募企業・団体の中から選出してください。\n","",{"$f":"IF(INDIRECT(\"書式1!\"&\"B\"&DR1)=\"\",\"\",INDIRECT(\"書式1!\"&\"B\"&DR1))","v":""},"","","","","応募担当補佐の所在地","",null,{"$f":"IF(INDIRECT(\"書式1!\"&\"B\"&DZ1)=\"\",\"\",INDIRECT(\"書式1!\"&\"B\"&DZ1))","v":""},"","応募担当補佐住所表示確認欄[⑯⑰⑱]","応募オフィスの延床面積[⑧]","オフィス構築の総費用","(内訳）　　企画・設計費","　　　　　　内装費","　　　　　　オフィス家具（施工含む）","　　　　　　オフィス機器（施工含む）","　　　　　　その他（引越し費用等）","","応募オフィスの従業員数［⑨］","天井高さ（床仕上げ面から）","一般執務スペース","執務用総席数","主なオフィスの運用方式","主なオフィスの運用方式","共有書類の総収容可能量","個人の書類等の収容量","オフィスづくりやオフィスの運用に関する調査の実施","オフィスづくりやオフィスの運用に関する調査の実施",{"$f":"+ES2","v":"オフィスづくりやオフィスの運用に関する調査の実施"},{"$f":"+ET2","v":"オフィスづくりやオフィスの運用に関する調査の実施"},{"$f":"+EU2","v":"オフィスづくりやオフィスの運用に関する調査の実施"},{"$f":"IF(INDIRECT(\"書式1!\"&\"B\"&EX1)=\"\",\"\",INDIRECT(\"書式1!\"&\"B\"&EX1))","v":"延床面積\n自社ビルの場合記入する。オフィスビル内に駐車場があるときにはそれも含めてください。"},{"$f":"IF(INDIRECT(\"書式1!\"&\"B\"&EY1)=\"\",\"\",INDIRECT(\"書式1!\"&\"B\"&EY1))","v":"建物の総費用\n自社ビルの場合記入する。"},{"$f":"IF(INDIRECT(\"書式1!\"&\"B\"&EZ1)=\"\",\"\",INDIRECT(\"書式1!\"&\"B\"&EZ1))","v":"(内訳) 　　企画・設計費"},{"$f":"IF(INDIRECT(\"書式1!\"&\"B\"&FA1)=\"\",\"\",INDIRECT(\"書式1!\"&\"B\"&FA1))","v":"　　　　　　工事費"},{"$f":"IF(INDIRECT(\"書式1!\"&\"B\"&FB1)=\"\",\"\",INDIRECT(\"書式1!\"&\"B\"&FB1))","v":""},"END"]
[{"$f":"FIND(\"]\",A1,1)","v":61},null,null,{"$f":"IF(INDIRECT(\"書式1!\"&\"C\"&D1)=\"\",\"\",INDIRECT(\"書式1!\"&\"C\"&D1))","v":""},"","","URL確認欄［①］","〒","都道府県","都道府県","市区町村番地","建物名","本社所在地表示確認欄［②③④］","電話","FAX","役職名","代表者氏名","","","","","","","","フリガナ","〒","都道府県","都道府県","市区町村番地","建物名","応募オフィス所在地表示確認欄［⑤⑥⑦］","地上",{"$f":"IF(INDIRECT(\"書式1!\"&\"C\"&AG1)=\"\",\"\",INDIRECT(\"書式1!\"&\"C\"&AG1))","v":"地上"},"地下","地下","",{"$f":"IF(INDIRECT(\"書式1!\"&\"C\"&AK1)=\"\",\"\",INDIRECT(\"書式1!\"&\"C\"&AK1))","v":""},"","","",{"$f":"IF(INDIRECT(\"書式1!\"&\"C\"&AO1)=\"\",\"\",INDIRECT(\"書式1!\"&\"C\"&AO1))","v":""},"","","","","","","","","","","","その他","","","","","",null,null,{"$f":"IF(INDIRECT(\"書式1!\"&\"C\"&BI1)=\"\",\"\",INDIRECT(\"書式1!\"&\"C\"&BI1))","v":""},{"$f":"IF(INDIRECT(\"書式1!\"&\"C\"&BJ1)=\"\",\"\",INDIRECT(\"書式1!\"&\"C\"&BJ1))","v":"その他"},{"$f":"IF(INDIRECT(\"書式1!\"&\"C\"&BK1)=\"\",\"\",INDIRECT(\"書式1!\"&\"C\"&BK1))","v":""},{"$f":"IF(INDIRECT(\"書式1!\"&\"C\"&BL1)=\"\",\"\",INDIRECT(\"書式1!\"&\"C\"&BL1))","v":""},{"$f":"+BL3","v":""},{"$f":"+BM3","v":""},{"$f":"IF(INDIRECT(\"書式1!\"&\"C\"&BO1)=\"\",\"\",INDIRECT(\"書式1!\"&\"C\"&BO1))","v":""},{"$f":"+BO3","v":""},{"$f":"+BP3","v":""},{"$f":"IF(INDIRECT(\"書式1!\"&\"C\"&BR1)=\"\",\"\",INDIRECT(\"書式1!\"&\"C\"&BR1))","v":""},"","","","","","","","","",{"$f":"+CA3","v":""},"","","","","",{"$f":"IF(INDIRECT(\"書式1!\"&\"C\"&CH1)=\"\",\"\",INDIRECT(\"書式1!\"&\"C\"&CH1))","v":"建物の施工"},{"$f":"+CH3","v":"建物の施工"},{"$f":"+CI3","v":"建物の施工"},{"$f":"IF(INDIRECT(\"書式1!\"&\"C\"&CK1)=\"\",\"\",INDIRECT(\"書式1!\"&\"C\"&CK1))","v":"オフィスの施工"},{"$f":"+CK3","v":"オフィスの施工"},{"$f":"+CL3","v":"オフィスの施工"},{"$f":"IF(INDIRECT(\"書式1!\"&\"C\"&CN1)=\"\",\"\",INDIRECT(\"書式1!\"&\"C\"&CN1))","v":"使用開始"},{"$f":"+CN3","v":"使用開始"},{"$f":"IF(INDIRECT(\"書式1!\"&\"C\"&CP1)=\"\",\"\",INDIRECT(\"書式1!\"&\"C\"&CP1))","v":"氏名"},"所属",{"$f":"IF(INDIRECT(\"書式1!\"&\"C\"&CR1)=\"\",\"\",INDIRECT(\"書式1!\"&\"C\"&CR1))","v":"役職"},"電話","携帯電話","FAX","Eメール","〒","都道府県","都道府県","市区町村番地","建物名","","氏名","所属",{"$f":"IF(INDIRECT(\"書式1!\"&\"C\"&DE1)=\"\",\"\",INDIRECT(\"書式1!\"&\"C\"&DE1))","v":"役職"},"電話","携帯電話","FAX","Eメール","〒","都道府県","都道府県","市区町村番地","建物名","","氏名","所属",{"$f":"IF(INDIRECT(\"書式1!\"&\"C\"&DR1)=\"\",\"\",INDIRECT(\"書式1!\"&\"C\"&DR1))","v":"役職"},"電話","携帯電話","FAX","Eメール","〒","都道府県",{"$f":"IF(INDIRECT(\"書式1!\"&\"C\"&DY1)=\"\",\"\",INDIRECT(\"書式1!\"&\"C\"&DY1))","v":"都道府県"},"市区町村番地","建物名","","","","","","","","","%計","","","","","","","","","企画・設計時","企画・設計時","使用開始時","使用開始時","定期的","","","","","%計","END"]
[{"$f":"MID(A1,A2+1,A3-A2-1)","v":"35th_entry.xlsm"},null,"単位→",{"$nulls":155},"END"]
["書式4.設問1-72",{"$nulls":43},"本社　","支社･支店　","研究所　","コールセンター　","店舗","ショールーム","その他",null,null,"総務・経理・人事　　","資材・調達・購買　　","企画・計画　　","設計・技術・研究 　　","営業・販売　　","生産管理・製造管理　　","その他",{"$nulls":25},"建築施工","建築施工開始","建築施工終了","オフィス施工","オフィス施工開始","オフィス施工終了","使用開始","使用開始日付","応募責任者","応募責任者","応募責任者","応募責任者","応募責任者","応募責任者","応募責任者","応募責任者","応募責任者","応募責任者","応募責任者","応募責任者",null,"応募担当者","応募担当者","応募担当者","応募担当者","応募担当者","応募担当者","応募担当者","応募担当者","応募担当者","応募担当者","応募担当者","応募担当者",null,"応募担当補佐","応募担当補佐","応募担当補佐","応募担当補佐","応募担当補佐","応募担当補佐","応募担当補佐","応募担当補佐","応募担当補佐","応募担当補佐","応募担当補佐","応募担当補佐",{"$nulls":22},"延床面積","建物の総費用",{"$nulls":3},"END"]
["ファイル名","日付","ユニーク値",{"$f":"+D2&D3","v":"企業・団体名（代表企業・団体）"},{"$f":"+E2&E3","v":"（英文字）"},{"$f":"+F2&F3","v":"URL"},{"$f":"+G2&G3","v":"URL確認欄［①］"},{"$f":"+H2&H3","v":"本社所在地〒"},{"$f":"+I2&I3&I7","v":"都道府県"},"都道府県（値）","市区町村番地","建物名","本社所在地表示確認欄［②③④］","電話","FAX","代表者名役職名","代表者氏名","資本金・出資金","応募時点の全従業員数\n(正規雇用・非正規雇用・受入出向・派遣社員を含む）","業種","業種（値）","上場","上場（値）","応募オフィス名称","※必ず記入要領を参照してください。フリガナ","応募オフィス所在地〒","都道府県","都道府県（値）","市区町村番地","建物名","応募オフィス所在地表示確認欄［⑤⑥⑦］","建物の規模地上",{"$f":"+AG2&AG3&AG7","v":"建物の規模地上（値）"},"地下","地下（値）","応募企業・団体の入居","応募企業・団体の入居（値）",{"$f":"+AL2&AL3&AL7","v":"「建物の部分」の場合は、階を記入→"},"応募オフィスの範囲","応募オフィスの範囲（値）","応募オフィスの範囲が、上記のＡ）またはＢ）の\n一部分の場合は、特定した理由と、その階を記入→","建物の築年数（年）","建物の築年数（月）","応募オフィスの延床面積",{"$f":"+AS5","v":"本社　"},"支社･支店　","研究所　","コールセンター　","店舗","ショールーム","その他",{"$f":"+AZ2&AZ3&AZ7","v":"応募オフィスの種類（値）"},{"$f":"+BA2&BA3&BA7","v":"その他"},{"$f":"+BB5","v":"総務・経理・人事　　"},"資材・調達・購買　　","企画・計画　　","設計・技術・研究 　　","営業・販売　　","生産管理・製造管理　　","その他",{"$f":"+BI2&BI3&BI7","v":"応募オフィスの主たる業務（値）"},"その他","応募オフィスの従業員数","応募オフィスの企画者・部門 社内","　　　〃　　　　 設計者・部門 社内","　　　〃　　　　 施工者・部門 社内","応募オフィスの企画者・部門 社外","　　　〃　　　　 設計者・部門 社外","　　　〃　　　　 施工者・部門 社外","オフィス内装の区分","オフィス内装の区分（値）","オフィス家具の区分","オフィス家具の区分（値）","オフィス機器の区分","オフィス機器の区分（値）","建物の所有形態","建物の所有形態（値）","建物の入居状況","建物の入居状況（値）","建物の企画者・部門 社内"," 〃  の設計者・部門 社内"," 〃  の工事者・部門 社内","建物の企画者・部門 社外"," 〃  の設計者・部門 社外"," 〃  の工事者・部門 社外",{"$f":"+CH5","v":"建築施工"},"建築施工開始","建築施工終了","オフィス施工","オフィス施工開始","オフィス施工終了","使用開始",{"$f":"+CO5","v":"使用開始日付"},{"$f":"+CP5&\"-\"&CP3","v":"応募責任者-氏名"},"応募責任者-所属",{"$f":"+CR5&\"-\"&CR3","v":"応募責任者-役職"},"応募責任者-電話","応募責任者-携帯電話","応募責任者-FAX","応募責任者-Eメール","応募責任者-〒","応募責任者-都道府県",{"$f":"+CY5&\"-\"&CY3&CY7","v":"応募責任者-都道府県（値）"},{"$f":"+CZ5&\"-\"&CZ3","v":"応募責任者-市区町村番地"},{"$f":"+DA5&\"-\"&DA3","v":"応募責任者-建物名"},{"$f":"+DB2","v":"応募責任者住所表示確認欄［⑩⑪⑫］"},{"$f":"+DC5&\"-\"&DC3","v":"応募担当者-氏名"},"応募担当者-所属",{"$f":"+DE5&\"-\"&DE3","v":"応募担当者-役職"},"応募担当者-電話","応募担当者-携帯電話","応募担当者-FAX","応募担当者-Eメール","応募担当者-〒","応募担当者-都道府県",{"$f":"+DL5&\"-\"&DL3&DL7","v":"応募担当者-都道府県（値）"},{"$f":"+DM5&\"-\"&DM3","v":"応募担当者-市区町村番地"},{"$f":"+DN5&\"-\"&DN3","v":"応募担当者-建物名"},{"$f":"+DO2","v":"応募担当者住所表示確認欄[⑬⑭⑮]"},{"$f":"+DP5&\"-\"&DP3","v":"応募担当補佐-氏名"},"応募担当補佐-所属",{"$f":"+DR5&\"-\"&DR3","v":"応募担当補佐-役職"},"応募担当補佐-電話","応募担当補佐-携帯電話","応募担当補佐-FAX","応募担当補佐-Eメール","応募担当補佐-〒","応募担当補佐-都道府県",{"$f":"+DY5&\"-\"&DY3&DY7","v":"応募担当補佐-都道府県（値）"},{"$f":"+DZ5&\"-\"&DZ3","v":"応募担当補佐-市区町村番地"},{"$f":"+EA5&\"-\"&EA3","v":"応募担当補佐-建物名"},{"$f":"+EB2","v":"応募担当補佐住所表示確認欄[⑯⑰⑱]"},{"$f":"TRIM(EC2&EC3&EC7)","v":"応募オフィスの延床面積[⑧]"},"オフィス構築の総費用","(内訳）　企画・設計費","内装費","オフィス家具（施工含む）","オフィス機器（施工含む）","その他（引越し費用等）","%計","応募オフィスの従業員数［⑨］","天井高さ（床仕上げ面から）","一般執務スペース","執務用総席数","主なオフィスの運用方式","主なオフィスの運用方式（値）","共有書類の総収容可能量","個人の書類等の収容量",{"$f":"+ES2&\"-\"&ES3&ES7","v":"オフィスづくりやオフィスの運用に関する調査の実施-企画・設計時"},{"$f":"+ET2&\"-\"&ET3&ET7","v":"オフィスづくりやオフィスの運用に関する調査の実施-企画・設計時（値）"},{"$f":"+EU2&\"-\"&EU3&EU7","v":"オフィスづくりやオフィスの運用に関する調査の実施-使用開始時"},{"$f":"+EV2&\"-\"&EV3&EV7","v":"オフィスづくりやオフィスの運用に関する調査の実施-使用開始時（値）"},{"$f":"+EW2&\"-\"&EW3&EW7","v":"オフィスづくりやオフィスの運用に関する調査の実施-定期的"},{"$f":"+EX5","v":"延床面積"},{"$f":"+EY2&EY3&EY7","v":"建物の総費用\n自社ビルの場合記入する。"},{"$f":"TRIM(EZ2&EZ3&EZ7)","v":"(内訳) 企画・設計費"},"工事費","%計","END"]
["単位",{"$nulls":8},"（値）",{"$nulls":10},"（値）",null,"（値）",{"$nulls":4},"（値）",{"$nulls":4},"（値）",null,"（値）",null,"（値）",null,null,"（値）",null,"（年）","（月）",{"$nulls":8},"（値）",{"$nulls":8},"（値）",{"$nulls":9},"（値）",null,"（値）",null,"（値）",null,"（値）",null,"（値）",{"$nulls":23},"（値）",{"$nulls":12},"（値）",{"$nulls":12},"（値）",{"$nulls":16},"（値）",{"$nulls":3},"（値）",null,"（値）",{"$nulls":6},"END"]
[{"$f":"A4","v":"35th_entry.xlsm"},{"$f":"NOW()","v":"2022-05-21T13:11:28.600"},{"$f":"書式1!D5&書式1!D23&書式1!D85","v":""},{"$f":"+INDIRECT(\"書式1!\"&\"D\"&D1)","v":0},{"$f":"+INDIRECT(\"書式1!\"&\"D\"&E1)","v":0},{"$f":"+INDIRECT(\"書式1!\"&\"D\"&F1)","v":0},{"$f":"+INDIRECT(\"書式1!\"&\"D\"&G1)","v":""},{"$f":"+INDIRECT(\"書式1!\"&\"D\"&H1)","v":0},{"$f":"VLOOKUP(J8,list!$M$4:$N$51,2,FALSE)","v":"選択してください"},{"$f":"+J9-1","v":0},{"$f":"+INDIRECT(\"書式1!\"&\"D\"&K1)","v":0},0,"",0,0,0,0,0,0,{"$f":"+VLOOKUP(U8,list!Z4:AA41,2,FALSE)","v":"選択してください"},{"$f":"+U9-1","v":0},{"$f":"+VLOOKUP(W8,list!AC4:AD6,2,FALSE)","v":{"$error":"#N/A"}},{"$f":"+W9","v":0},{"$f":"+INDIRECT(\"書式1!\"&\"D\"&X1)","v":0},{"$f":"+INDIRECT(\"書式1!\"&\"D\"&Y1)","v":0},{"$f":"+INDIRECT(\"書式1!\"&\"D\"&Z1)","v":0},{"$f":"VLOOKUP(AB8,list!$M$4:$N$51,2,FALSE)","v":"選択してください"},{"$f":"+AB9-1","v":0},{"$f":"+INDIRECT(\"書式1!\"&\"D\"&AC1)","v":0},{"$f":"+INDIRECT(\"書式1!\"&\"D\"&AD1)","v":0},{"$f":"+INDIRECT(\"書式1!\"&\"D\"&AE1)","v":""},{"$f":"+AG8","v":0},{"$f":"+AG9-1","v":0},{"$f":"+VLOOKUP(AI8,list!$I$3:$J$13,2,FALSE)","v":"選択してください"},{"$f":"+AI9-1","v":0},{"$f":"+VLOOKUP(AK8,list!AC9:AD10,2,FALSE)","v":{"$error":"#N/A"}},{"$f":"+AK9","v":0},{"$f":"+INDIRECT(\"書式1!\"&\"D\"&AL1)","v":0},{"$f":"+VLOOKUP(AN8,list!AC13:AD14,2,FALSE)","v":{"$error":"#N/A"}},{"$f":"+AN9","v":0},{"$f":"+INDIRECT(\"書式1!\"&\"D\"&AO1)","v":0},{"$f":"+AP9-1","v":0},{"$f":"+AQ9-1","v":0},{"$f":"+INDIRECT(\"書式1!\"&\"D\"&AR1)","v":0},{"$f":"+IF(AS9,AS6,\"\")","v":""},{"$f":"+IF(AT9,AT6,\"\")","v":""},"","","","","",{"$f":"+IF(AS9,1,\"\")&IF(AT9,\",2\",\"\")&IF(AU9,\",3\",\"\")&IF(AV9,\",4\",\"\")&IF(AW9,\",5\",\"\")&IF(AX9,\",6\",\"\")&IF(AY9,\",7\",\"\")","v":""},{"$f":"+INDIRECT(\"書式1!\"&\"D\"&BA1)","v":0},{"$f":"+IF(BB9,BB6,\"\")","v":""},"","","","","","",{"$f":"+IF(BB9,1,\"\")&IF(BC9,\",2\",\"\")&IF(BD9,\",3\",\"\")&IF(BE9,\",4\",\"\")&IF(BF9,\",5\",\"\")&IF(BG9,\",6\",\"\")&IF(BH9,\",7\",\"\")","v":""},{"$f":"+INDIRECT(\"書式1!\"&\"D\"&BJ1)","v":0},0,0,0,0,0,0,0,{"$f":"VLOOKUP(BS8,list!$AC$17:$AF$19,2,FALSE)","v":{"$error":"#N/A"}},{"$f":"+BS9","v":0},{"$f":"VLOOKUP(BU8,list!$AC$17:$AF$19,3,FALSE)","v":{"$error":"#N/A"}},{"$f":"+BU9","v":0},{"$f":"VLOOKUP(BW8,list!$AC$17:$AF$19,4,FALSE)","v":{"$error":"#N/A"}},{"$f":"+BW9","v":0},{"$f":"VLOOKUP(BY8,list!$AC$40:$AD$41,2,FALSE)","v":{"$error":"#N/A"}},{"$f":"+BY9","v":0},{"$f":"VLOOKUP(CA8,list!AC22:AD23,2,FALSE)","v":{"$error":"#N/A"}},{"$f":"+CA9","v":0},{"$f":"+INDIRECT(\"書式1!\"&\"D\"&CB1)","v":0},0,0,0,0,0,{"$f":"CH13&\"年\"&CH14&\"月～\"&CH15&\"年\"&CH16&\"月\"","v":"選択年選択月～選択年選択月"},{"$f":"DATE(CH13,CH14,1)","v":{"$error":"#VALUE!"}},{"$f":"DATE(CH15,CH16,1)","v":{"$error":"#VALUE!"}},{"$f":"CK13&\"年\"&CK14&\"月～\"&CK15&\"年\"&CK16&\"月\"","v":"選択年選択月～選択年選択月"},{"$f":"DATE(CK13,CK14,1)","v":{"$error":"#VALUE!"}},{"$f":"DATE(CK15,CK16,1)","v":{"$error":"#VALUE!"}},{"$f":"CN13&\"年\"&CN14&\"月\"","v":"選択年選択月"},{"$f":"DATE(CN13,CN14,1)","v":{"$error":"#VALUE!"}},{"$f":"+INDIRECT(\"書式1!\"&\"D\"&CP1)","v":0},0,{"$f":"+INDIRECT(\"書式1!\"&\"D\"&CR1)","v":0},0,0,0,0,0,{"$f":"VLOOKUP(CY8,list!$M$4:$N$51,2,FALSE)","v":"選択してください"},{"$f":"+CY9-1","v":0},{"$f":"+INDIRECT(\"書式1!\"&\"D\"&CZ1)","v":0},0,"",0,0,{"$f":"+INDIRECT(\"書式1!\"&\"D\"&DE1)","v":0},0,0,0,0,0,{"$f":"VLOOKUP(DL8,list!$M$4:$N$51,2,FALSE)","v":"選択してください"},{"$f":"+DL9-1","v":0},{"$f":"+INDIRECT(\"書式1!\"&\"D\"&DM1)","v":0},0,"",0,0,{"$f":"+INDIRECT(\"書式1!\"&\"D\"&DR1)","v":0},0,0,0,0,0,{"$f":"VLOOKUP(DY8,list!$M$4:$N$51,2,FALSE)","v":"選択してください"},{"$f":"+DY9-1","v":0},{"$f":"+INDIRECT(\"書式1!\"&\"D\"&DZ1)","v":0},0,"","0㎡",0,0,0,0,0,0,"合計が１００％になっていません","0人",0,0,0,{"$f":"+VLOOKUP(EP8,list!AC26:AD27,2,FALSE)","v":{"$error":"#N/A"}},{"$f":"+EP9","v":0},{"$f":"+INDIRECT(\"書式1!\"&\"D\"&EQ1)","v":0},{"$f":"+INDIRECT(\"書式1!\"&\"D\"&ER1)","v":0},{"$f":"+VLOOKUP(ET8,list!$AC$30:$AD$31,2,FALSE)","v":{"$error":"#N/A"}},{"$f":"+ET9","v":0},{"$f":"+VLOOKUP(EV8,list!$AC$30:$AD$31,2,FALSE)","v":{"$error":"#N/A"}},{"$f":"+EV9","v":0},{"$f":"+INDIRECT(\"書式1!\"&\"D\"&EW1)","v":0},0,0,0,0,"","END"]
["※上記の太枠「8行名」が、集計シートに転記される値",{"$nulls":7},"リンク値⇒",1,{"$nulls":9},"リンク値⇒",1,"リンク値⇒",0,null,3,null,"リンク値⇒",1,{"$nulls":3},"リンク値⇒",1,3,1,"リンク値⇒",0,null,"リンク値⇒",0,null,1,1,null,false,false,false,false,false,false,false,null,null,false,false,false,false,false,false,false,{"$nulls":9},"リンク値⇒",0,"リンク値⇒",0,"リンク値⇒",0,"リンク値⇒",0,"リンク値⇒",0,{"$nulls":6},1,null,null,1,null,null,1,{"$nulls":9},"リンク値⇒",1,{"$nulls":11},"リンク値⇒",1,{"$nulls":11},"リンク値⇒",1,{"$nulls":15},"リンク値⇒",0,0,0,"リンク値⇒",0,0,0,0]
[{"$nulls":8},"※集計時を考えて0から開始",{"$nulls":10},"※集計時を考えて0から開始",{"$nulls":6},"※集計時を考えて0から開始",{"$nulls":6},"1から開始",{"$nulls":7},"リンク値↑","リンク値↑",{"$nulls":26},"1から開始",null,"1から開始",null,"1から開始",null,"1から開始",null,"1から開始",{"$nulls":7},1,null,null,1,null,null,1,{"$nulls":9},"※集計時を考えて0から開始",{"$nulls":12},"※集計時を考えて0から開始",{"$nulls":12},"※集計時を考えて0から開始",{"$nulls":16},"1から開始",{"$nulls":3},"1から開始",null,"1から開始"]
[{"$nulls":85},1,null,null,1]
[false,{"$nulls":84},1,null,null,1]
[{"$nulls":85},{"$f":"VLOOKUP(CH9,list!$O$4:$Q$55,3,FALSE)","v":"選択"},null,null,{"$f":"VLOOKUP(CK9,list!$O$4:$Q$55,3,FALSE)","v":"選択"},null,null,{"$f":"VLOOKUP(CN9,list!$O$4:$Q$55,3,FALSE)","v":"選択"}]
[{"$nulls":85},{"$f":"VLOOKUP(CH10,list!$R$4:$S$16,2)","v":"選択"},null,null,{"$f":"VLOOKUP(CK10,list!$R$4:$S$16,2)","v":"選択"},null,null,{"$f":"VLOOKUP(CN10,list!$R$4:$S$16,2)","v":"選択"}]
[{"$nulls":85},{"$f":"VLOOKUP(CH11,list!$O$4:$Q$55,3,FALSE)","v":"選択"},null,null,{"$f":"VLOOKUP(CK11,list!$O$4:$Q$55,3,FALSE)","v":"選択"}]
[{"$nulls":85},{"$f":"VLOOKUP(CH12,list!$R$4:$S$16,2)","v":"選択"},null,null,{"$f":"VLOOKUP(CK12,list!$R$4:$S$16,2)","v":"選択"}]
{"$rows_empty":23}
[{"$nulls":3},1,"選択してください"]
[{"$nulls":3},2,"前"]
[{"$nulls":3},3,"後"]

{"sheet":"処理中","index":6,"n_rows":19,"n_cols":4,"rows_kept":19,"hidden":true}
{"$rows_empty":13}
[{"$nulls":3},"処　理　中"]
[]
[]
[]
[]
[{"$nulls":3},"しばらくお待ちください"]

{"sheet":"Record3","index":7,"n_rows":19,"n_cols":127,"rows_kept":19,"hidden":true}
[{"$nulls":3},"地球環境保全",{"$nulls":71},"オフィスセキュリティ"]
[{"$nulls":3},"省エネ対策",{"$nulls":24},"会議スペース",{"$nulls":10},"接客スペース",{"$nulls":14},"リフレッシュスペース",{"$nulls":8},"喫煙スペース",{"$nulls":11},"組織的セキュリティ対策",{"$nulls":3},"人的セキュリティ対策",null,"資産の分類及び管理",{"$nulls":6},"物理的セキュリティ対策",{"$nulls":28},"技術的セキュリティ対策",{"$nulls":7},"事業継続管理"]
[{"$nulls":3},152,{"$nulls":3},153,null,null,154,155,{"$nulls":5},156,null,157,158,null,159,{"$nulls":5},160,{"$nulls":4},161,{"$nulls":4},162,163,null,164,{"$nulls":3},165,166,{"$nulls":3},167,null,null,168,169,170,171,172,{"$nulls":5},173,null,174,null,175,176,{"$nulls":6},177,178,null,179,180,181,182,183,184,185,186,187,188,189,190,191,{"$nulls":8},192,193,{"$nulls":8},194,195,196,null,197,null,198,null,199,{"$nulls":7},200]
[{"$nulls":3},"空調",{"$nulls":3},"室内温度の設定の規定",null,null,"クールビズ・ウォームビズの実施","照明",{"$nulls":5},"分別廃棄",null,"グリーン購入","家具の買替えサイクル規程",null,"ペーパレスへの取組み",{"$nulls":5},"会議室の設置",{"$nulls":4},"会議室の設備",{"$nulls":4},"会議室の占有面積","受付",null,"ロビー",{"$nulls":3},"ロビーの占有面積（受付スペース含む）","接客設備",{"$nulls":3},"応接室の設備",null,null,"応接室の占有面積","リフレッシュスペースの有無","リフレッシュスペースの種類","リフレッシュスペースの大きさ","リフレッシュスペースの設備",{"$nulls":5},"喫煙設備",null,"排煙対策",null,"サーバー室面積","その他",{"$nulls":6},"セキュリティに関する基本方針が文書化され組織全体で共有されている","セキュリティに関する管理組織がある。","「YES」と回答された方は、その具体的な役割をご記入ください","外部委託先と秘密保持の契約を締結している","従業員と秘密保持に関する契約書を締結している","セキュリティに関する従業員教育を実施している","書類やその他資産の重要度に応じて分類し、管理している","重要書類の取扱い・持ち出しのルールがあり、遵守されている","重要書類の廃棄のルールがあり、遵守されている","モバイルＰＣの持ち出しのルールがあり、遵守されている","モバイルＰＣの廃棄のルールがあり、遵守されている","電子媒体の持ち出しのルールがあり、遵守されている","電子媒体の廃棄のルールがあり、遵守されている","セキュリティレベルに応じてオフィスを明確に区分している","オフィスの設計図が、継続的に更新されており、管理されている","入退室管理を実施している",{"$nulls":8},"入退室におけるアクセス記録をとっている","保管庫・キャビネット等の施錠ついて、保管・保存する書類等の",{"$nulls":8},"保管庫・キャビネット等のアクセス記録をとっている","収納家具の地震対策を行っている","コピー機、ＦＡＸ機、プリンタ等の出力機器に対してセキュリテイ対策を実施している。","「YES」と回答された方は、その内容を具体的にご記入ください","地震、水害、火災等の非常時を想定したスペース及び避難ルートの確保、設備対策、備品保存等が行われている。","「YES」と回答された方は、その内容を具体的にご記入ください","重大な犯罪・テロ対策について対策を行っている","「YES」と回答された方は、その内容を具体的にご記入ください","情報システムにおけるセキュリティ対策を実施している",{"$nulls":7},"事業継続管理を行っている"]
["書式4.設問152-200",null,null,"ゾーン制御可能","窓開閉可能","その他","その他",null,"夏季","冬季",null,"ゾーン制御","人感センサー付","昼光利用制御","高効率照明器具","その他","その他",null,"分別の種類",null,null,"その他","プリントアウトの制限","コピーの制限","収納家具の削減","ペーパーの再利用","その他","その他","集中して設置","各フロアに分散して設置","部門に付帯して設置","その他","その他","ＡＶ会議室","TV会議室","コピーボード","その他","その他",null,null,"その他","待合スペース","商談スペース","その他","その他",null,"応接室","商談コーナー","その他","その他","応接セット","チェア＋テーブル","プレゼンテーション設備",{"$nulls":4},"チェアのみ","チェアとテーブル","自販機設置","カフェ設備","その他","その他",null,"その他",null,"その他",null,"倉庫","ロッカー室","休養室","シャワー室","食堂","その他","その他",{"$nulls":15},"鍵－機械鍵方式","鍵－ダイヤル方式","鍵－テンキー方式","鍵－カード方式","鍵－生体認証方式","人－受付","人－ガードマン","その他","その他",null,"鍵－機械鍵方式","鍵－ダイヤル方式","鍵－テンキー方式","鍵－カード方式","鍵－生体認証方式","人－受付","人－ガードマン","その他","その他",{"$nulls":8},"データのバックアップ対策","設備の２重化対策","ウイルス対策","アクセス制御","ログ管理","電磁シールド","その他","その他",null,"「YES」と回答された方は、その内容を具体的にご記入ください"]
["ファイル名","日付","ユニーク値",{"$f":"D3&\"/\"&D4&\"/\"&D5","v":"152/空調/ゾーン制御可能"},{"$f":"E3&\"/\"&E4&\"/\"&E5","v":"//窓開閉可能"},"//その他","//その他","153/室内温度の設定の規定/","//夏季","//冬季","154/クールビズ・ウォームビズの実施/","155/照明/ゾーン制御","//人感センサー付","//昼光利用制御","//高効率照明器具","//その他","//その他","156/分別廃棄/","//分別の種類","157/グリーン購入/","158/家具の買替えサイクル規程/","//その他","159/ペーパレスへの取組み/プリントアウトの制限","//コピーの制限","//収納家具の削減","//ペーパーの再利用","//その他","//その他","160/会議室の設置/集中して設置","//各フロアに分散して設置","//部門に付帯して設置","//その他","//その他","161/会議室の設備/ＡＶ会議室","//TV会議室","//コピーボード","//その他","//その他","162/会議室の占有面積/","163/受付/","//その他","164/ロビー/待合スペース","//商談スペース","//その他","//その他","165/ロビーの占有面積（受付スペース含む）/","166/接客設備/応接室","//商談コーナー","//その他","//その他","167/応接室の設備/応接セット","//チェア＋テーブル","//プレゼンテーション設備","168/応接室の占有面積/","169/リフレッシュスペースの有無/","170/リフレッシュスペースの種類/","171/リフレッシュスペースの大きさ/","172/リフレッシュスペースの設備/チェアのみ","//チェアとテーブル","//自販機設置","//カフェ設備","//その他","//その他","173/喫煙設備/","//その他",{"$f":"BN3&\"/\"&BN4&\"/\"&BN5","v":"174/排煙対策/"},"//その他","175/サーバー室面積/","176/その他/倉庫","//ロッカー室","//休養室","//シャワー室","//食堂","//その他","//その他","177/セキュリティに関する基本方針が文書化され組織全体で共有されている/","178/セキュリティに関する管理組織がある。/","/「YES」と回答された方は、その具体的な役割をご記入ください/","179/外部委託先と秘密保持の契約を締結している/","180/従業員と秘密保持に関する契約書を締結している/","181/セキュリティに関する従業員教育を実施している/","182/書類やその他資産の重要度に応じて分類し、管理している/","183/重要書類の取扱い・持ち出しのルールがあり、遵守されている/","184/重要書類の廃棄のルールがあり、遵守されている/","185/モバイルＰＣの持ち出しのルールがあり、遵守されている/","186/モバイルＰＣの廃棄のルールがあり、遵守されている/","187/電子媒体の持ち出しのルールがあり、遵守されている/","188/電子媒体の廃棄のルールがあり、遵守されている/","189/セキュリティレベルに応じてオフィスを明確に区分している/","190/オフィスの設計図が、継続的に更新されており、管理されている/","191/入退室管理を実施している/鍵－機械鍵方式","//鍵－ダイヤル方式","//鍵－テンキー方式","//鍵－カード方式","//鍵－生体認証方式","//人－受付","//人－ガードマン","//その他","//その他","192/入退室におけるアクセス記録をとっている/","193/保管庫・キャビネット等の施錠ついて、保管・保存する書類等の/鍵－機械鍵方式","//鍵－ダイヤル方式","//鍵－テンキー方式","//鍵－カード方式","//鍵－生体認証方式","//人－受付","//人－ガードマン","//その他","//その他","194/保管庫・キャビネット等のアクセス記録をとっている/","195/収納家具の地震対策を行っている/","196/コピー機、ＦＡＸ機、プリンタ等の出力機器に対してセキュリテイ対策を実施している。/","/「YES」と回答された方は、その内容を具体的にご記入ください/","197/地震、水害、火災等の非常時を想定したスペース及び避難ルートの確保、設備対策、備品保存等が行われている。/","/「YES」と回答された方は、その内容を具体的にご記入ください/","198/重大な犯罪・テロ対策について対策を行っている/","/「YES」と回答された方は、その内容を具体的にご記入ください/","199/情報システムにおけるセキュリティ対策を実施している/データのバックアップ対策","//設備の２重化対策","//ウイルス対策","//アクセス制御","//ログ管理","//電磁シールド","//その他","//その他","200/事業継続管理を行っている/",{"$f":"DW3&\"/\"&DW4&\"/\"&DW5","v":"//「YES」と回答された方は、その内容を具体的にご記入ください"}]
["単位",{"$nulls":7},"℃","℃",{"$nulls":8},"種類",{"$nulls":19},"㎡",{"$nulls":6},"㎡",{"$nulls":7},"㎡",null,null,"㎡",{"$nulls":10},"㎡"]
[{"$f":"Record1!A4","v":"35th_entry.xlsm"},{"$f":"NOW()","v":"2022-05-21T13:11:28.600"},{"$f":"書式1!#REF!&書式1!D23&書式1!D85","v":{"$error":"#REF!"}},{"$f":"IF(D9=TRUE,D5,\"\")","v":""},{"$f":"IF(E9=TRUE,E5,\"\")","v":""},{"$f":"IF(F9=TRUE,F5,\"\")","v":""},{"$f":"IF(F8=\"その他\",#REF!,\"\")","v":""},{"$f":"VLOOKUP(H9,Record1!#REF!,2)","v":{"$error":"#REF!"}},{"$f":"IF(H8=\"有り\",#REF!,\"\")","v":{"$error":"#REF!"}},{"$f":"IF(H8=\"有り\",#REF!,\"\")","v":{"$error":"#REF!"}},{"$f":"VLOOKUP(K9,Record1!#REF!,2)","v":{"$error":"#REF!"}},{"$f":"IF(L9=TRUE,L5,\"\")","v":""},{"$f":"IF(M9=TRUE,M5,\"\")","v":""},{"$f":"IF(N9=TRUE,N5,\"\")","v":""},{"$f":"IF(O9=TRUE,O5,\"\")","v":""},{"$f":"IF(P9=TRUE,P5,\"\")","v":""},{"$f":"IF(P8=\"その他\",#REF!,\"\")","v":""},{"$f":"VLOOKUP(R9,$Q$13:$R$14,2)","v":"実施"},{"$f":"IF(R8=\"実施\",#REF!,\"\")","v":{"$error":"#REF!"}},{"$f":"VLOOKUP(T9,$Q$13:$R$14,2)","v":"実施"},{"$f":"VLOOKUP(U9,$T$13:$U$19,2)","v":"5年"},{"$f":"IF(U8=\"その他\",#REF!,\"\")","v":""},{"$f":"IF(W9=TRUE,W5,\"\")","v":""},{"$f":"IF(X9=TRUE,X5,\"\")","v":""},{"$f":"IF(Y9=TRUE,Y5,\"\")","v":""},{"$f":"IF(Z9=TRUE,Z5,\"\")","v":""},{"$f":"IF(AA9=TRUE,AA5,\"\")","v":""},{"$f":"IF(AA8=\"その他\",#REF!,\"\")","v":""},{"$f":"IF(AC9=TRUE,AC5,\"\")","v":""},{"$f":"IF(AD9=TRUE,AD5,\"\")","v":""},{"$f":"IF(AE9=TRUE,AE5,\"\")","v":""},{"$f":"IF(AF9=TRUE,AF5,\"\")","v":""},{"$f":"IF(AF8=\"その他\",#REF!,\"\")","v":""},{"$f":"IF(AH9=TRUE,AH5,\"\")","v":""},{"$f":"IF(AI9=TRUE,AI5,\"\")","v":""},{"$f":"IF(AJ9=TRUE,AJ5,\"\")","v":""},{"$f":"IF(AK9=TRUE,AK5,\"\")","v":""},{"$f":"IF(AK8=\"その他\",#REF!,\"\")","v":""},{"$f":"#REF!","v":{"$error":"#REF!"}},{"$f":"VLOOKUP(AN9,$AM$13:$AN$16,2)","v":"無人受付"},{"$f":"IF(AN8=\"その他\",#REF!,\"\")","v":""},{"$f":"IF(AP9=TRUE,AP5,\"\")","v":""},{"$f":"IF(AQ9=TRUE,AQ5,\"\")","v":""},{"$f":"IF(AR9=TRUE,AR5,\"\")","v":""},{"$f":"IF(AR8=\"その他\",#REF!,\"\")","v":""},{"$f":"#REF!","v":{"$error":"#REF!"}},{"$f":"IF(AU9=TRUE,AU5,\"\")","v":""},{"$f":"IF(AV9=TRUE,AV5,\"\")","v":""},{"$f":"IF(AW9=TRUE,AW5,\"\")","v":""},{"$f":"IF(AW8=\"その他\",#REF!,\"\")","v":""},{"$f":"IF(AY9=TRUE,AY5,\"\")","v":""},{"$f":"IF(AZ9=TRUE,AZ5,\"\")","v":""},{"$f":"IF(BA9=TRUE,BA5,\"\")","v":""},{"$f":"#REF!","v":{"$error":"#REF!"}},{"$f":"VLOOKUP(BC9,Record1!#REF!,2)","v":{"$error":"#REF!"}},{"$f":"VLOOKUP(BD9,$BC$13:$BD$14,2)","v":"個室スペース"},{"$f":"#REF!","v":{"$error":"#REF!"}},{"$f":"IF(BF9=TRUE,BF5,\"\")","v":""},{"$f":"IF(BG9=TRUE,BG5,\"\")","v":""},{"$f":"IF(BH9=TRUE,BH5,\"\")","v":""},{"$f":"IF(BI9=TRUE,BI5,\"\")","v":""},{"$f":"IF(BJ9=TRUE,BJ5,\"\")","v":""},{"$f":"IF(BJ8=\"その他\",#REF!,\"\")","v":""},{"$f":"VLOOKUP(BL9,$BK$13:$BL$17,2)","v":"喫煙室を設置"},{"$f":"IF(BL8=\"その他\",#REF!,\"\")","v":""},{"$f":"VLOOKUP(BN9,$BM$13:$BN$16,2)","v":"屋外強制排気"},{"$f":"IF(BN8=\"その他\",#REF!,\"\")","v":""},{"$f":"#REF!","v":{"$error":"#REF!"}},{"$f":"IF(BQ9=TRUE,BQ5,\"\")","v":""},"","","","","",{"$f":"IF(BV8=\"その他\",#REF!,\"\")","v":""},{"$f":"VLOOKUP(BX9,$BW$13:$BX$14,2)","v":"YES"},{"$f":"VLOOKUP(BY9,$BW$13:$BX$14,2)","v":"YES"},{"$f":"IF(BY8=\"YES\",#REF!,\"\")","v":{"$error":"#REF!"}},{"$f":"VLOOKUP(CA9,$BW$13:$BX$14,2)","v":"YES"},{"$f":"VLOOKUP(CB9,$BW$13:$BX$14,2)","v":"NO"},{"$f":"VLOOKUP(CC9,$BW$13:$BX$14,2)","v":"YES"},"YES","YES","YES","YES","YES","YES","YES","YES","YES",{"$f":"IF(CM9=TRUE,CM5,\"\")","v":""},"","","","","","","",{"$f":"IF(CT8=\"その他\",#REF!,\"\")","v":""},"YES",{"$f":"IF(CW9=TRUE,CW5,\"\")","v":""},"","","","","","","",{"$f":"IF(DD8=\"その他\",#REF!,\"\")","v":""},{"$f":"VLOOKUP(DF9,$BW$13:$BX$14,2)","v":"YES"},{"$f":"VLOOKUP(DG9,$BW$13:$BX$14,2)","v":"YES"},{"$f":"VLOOKUP(DH9,$BW$13:$BX$14,2)","v":"YES"},{"$f":"IF(DH8=\"YES\",#REF!,\"\")","v":{"$error":"#REF!"}},{"$f":"VLOOKUP(DJ9,$BW$13:$BX$14,2)","v":"YES"},{"$f":"IF(DJ8=\"YES\",#REF!,\"\")","v":{"$error":"#REF!"}},{"$f":"VLOOKUP(DL9,$BW$13:$BX$14,2)","v":"YES"},{"$f":"IF(DL8=\"YES\",#REF!,\"\")","v":{"$error":"#REF!"}},{"$f":"IF(DN9=TRUE,DN5,\"\")","v":""},"","","","","","",{"$f":"IF(DT8=\"その他\",#REF!,\"\")","v":""},{"$f":"VLOOKUP(DV9,$BW$13:$BX$14,2)","v":"YES"},{"$f":"IF(DV8=\"YES\",#REF!,\"\")","v":{"$error":"#REF!"}}]
[{"$nulls":3},false,false,false,null,1,null,null,1,false,false,false,false,false,null,1,null,1,1,null,false,false,false,false,false,null,false,false,false,false,null,false,false,false,false,null,null,1,null,false,false,false,null,null,false,false,false,null,false,false,false,null,1,1,null,false,false,false,false,false,null,1,null,1,null,null,false,false,false,false,false,false,null,1,1,null,1,11,1,1,1,1,1,1,1,1,1,1,false,false,false,false,false,false,false,false,null,1,false,false,false,false,false,false,false,false,null,1,1,1,null,1,null,1,null,false,false,false,false,false,false,false,null,1]
[]
[]
[]
[{"$nulls":16},1,"実施",null,1,"5年",{"$nulls":17},1,"無人受付",{"$nulls":14},1,"個室スペース",{"$nulls":6},1,"喫煙室を設置",1,"屋外強制排気",{"$nulls":8},1,"YES"]
[{"$nulls":16},2,"未実施",null,2,"7年",{"$nulls":17},2,"有人受付",{"$nulls":14},2,"オープンスペース",{"$nulls":6},2,"オープンスペース",2,"吸煙設備",{"$nulls":8},2,"NO"]
[{"$nulls":19},3,"10年",{"$nulls":17},3,"ビル共用受付",{"$nulls":22},3,"屋外",3,"その他"]
[{"$nulls":19},4,"13年",{"$nulls":17},4,"その他",{"$nulls":22},4,"その他",4,"無し"]
[{"$nulls":19},5,"15年",{"$nulls":41},5,"無し"]
[{"$nulls":19},6,"その他"]
[{"$nulls":19},7,"無し"]

{"sheet":"list","index":8,"n_rows":103,"n_cols":32,"rows_kept":103,"hidden":true,"merged":[[1,22,1,23]]}
[]
[{"$nulls":6},"ビルの階数",null,null,"地下",{"$nulls":3},"リスト",null,"プルダウン用","データ用",{"$nulls":5},"建物"]
[{"$nulls":5},0,"選択してください",null,0,"選択してください",{"$nulls":3},"都道府県",null,"年","年",null,"月",{"$nulls":3},"年","月"]
[{"$nulls":5},1,1,null,1,"なし",null,null,0,"選択してください",1,"選択","選択",1,"選択",{"$nulls":3},0,0,null,0,"選択してください",null,1,"上場"]
[{"$nulls":5},2,2,null,2,1,null,null,1,"北海道",2,2022,2022,2,1,{"$nulls":3},1,1,null,1,"水産",null,2,"未上場"]
[{"$nulls":5},3,3,null,3,2,null,null,2,"青森県",3,2021,2021,3,2,{"$nulls":3},2,2,null,2,"鉱業",null,3,"該当無し（企業以外）"]
[{"$nulls":5},4,4,null,4,3,null,null,3,"岩手県",4,2020,2020,4,3,{"$nulls":3},3,3,null,3,"建設"]
[{"$nulls":5},5,5,null,5,4,null,null,4,"宮城県",5,2019,2019,5,4,{"$nulls":3},4,4,null,4,"食品"]
[{"$nulls":5},6,6,null,6,5,null,null,5,"秋田県",6,2018,2018,6,5,{"$nulls":3},5,5,null,5,"繊維",null,1,"Ａ）建物全体"]
[{"$nulls":5},7,7,null,7,6,null,null,6,"山形県",7,2017,2017,7,6,{"$nulls":3},6,6,null,6,"パルプ・紙",null,2,"Ｂ）建物の部分"]
[{"$nulls":5},8,8,null,8,7,null,null,7,"福島県",8,2016,2016,8,7,{"$nulls":3},7,7,null,7,"化学工業"]
[{"$nulls":5},9,9,null,9,8,null,null,8,"茨城県",9,2015,2015,9,8,{"$nulls":3},8,8,null,8,"医薬品"]
[{"$nulls":5},10,10,null,10,9,null,null,9,"栃木県",10,2014,2014,10,9,{"$nulls":3},9,9,null,9,"石油",null,1,"上記Ａ）・Ｂ）と同様"]
[{"$nulls":5},11,11,null,11,10,null,null,10,"群馬県",11,2013,2013,11,10,{"$nulls":3},10,10,null,10,"ゴム",null,2,"上記Ａ）またはＢ）の一部"]
[{"$nulls":5},12,12,{"$nulls":5},11,"埼玉県",12,2012,2012,12,11,{"$nulls":3},11,11,null,11,"窯業"]
[{"$nulls":5},13,13,{"$nulls":5},12,"千葉県",13,2011,2011,13,12,{"$nulls":3},12,12,null,12,"鉄鋼業"]
[{"$nulls":5},14,14,{"$nulls":5},13,"東京都",14,2010,2010,{"$nulls":5},13,null,null,13,"非鉄金属・金属製品",null,1,"新規施工","新規使用","新規使用"]
[{"$nulls":5},15,15,{"$nulls":5},14,"神奈川県",15,2009,2009,{"$nulls":5},14,null,null,14,"機械",null,2,"現行","既存使用","既存使用"]
[{"$nulls":5},16,16,{"$nulls":5},15,"新潟県",16,2008,2008,{"$nulls":5},15,null,null,15,"電気機器",null,3,"新規施工・現状","新規・既存使用","新規・既存使用"]
[{"$nulls":5},17,17,{"$nulls":5},16,"富山県",17,2007,2007,{"$nulls":5},16,null,null,16,"造船"]
[{"$nulls":5},18,18,{"$nulls":5},17,"石川県",18,2006,2006,{"$nulls":5},17,null,null,17,"自動車・自動車部品"]
[{"$nulls":5},19,19,{"$nulls":5},18,"福井県",19,2005,2005,{"$nulls":5},18,null,null,18,"その他輸送機器",null,1,"新築"]
[{"$nulls":5},20,20,{"$nulls":5},19,"山梨県",20,2004,2004,{"$nulls":5},19,null,null,19,"精密機器",null,2,"既存"]
[{"$nulls":5},21,21,{"$nulls":5},20,"長野県",21,2003,2003,{"$nulls":5},20,null,null,20,"その他製造業"]
[{"$nulls":5},22,22,{"$nulls":5},21,"岐阜県",22,2002,2002,{"$nulls":5},21,null,null,21,"商社"]
[{"$nulls":5},23,23,{"$nulls":5},22,"静岡県",23,2001,2001,{"$nulls":5},22,null,null,22,"小売業",null,1,"固定"]
[{"$nulls":5},24,24,{"$nulls":5},23,"愛知県",24,2000,2000,{"$nulls":5},23,null,null,23,"銀行",null,2,"フリーアドレス"]
[{"$nulls":5},25,25,{"$nulls":5},24,"三重県",25,1999,1999,{"$nulls":5},24,null,null,24,"証券"]
[{"$nulls":5},26,26,{"$nulls":5},25,"滋賀県",26,1998,1998,{"$nulls":5},25,null,null,25,"保険"]
[{"$nulls":5},27,27,{"$nulls":5},26,"京都府",27,1997,1997,{"$nulls":5},26,null,null,26,"その他金融業",null,1,"有り"]
[{"$nulls":5},28,28,{"$nulls":5},27,"大阪府",28,1996,1996,{"$nulls":5},27,null,null,27,"不動産",null,2,"無し"]
[{"$nulls":5},29,29,{"$nulls":5},28,"兵庫県",29,1995,1995,{"$nulls":5},28,null,null,28,"鉄道・バス"]
[{"$nulls":5},30,30,{"$nulls":5},29,"奈良県",30,1994,1994,{"$nulls":5},29,null,null,29,"陸運"]
[{"$nulls":5},31,31,{"$nulls":5},30,"和歌山県",31,1993,1993,{"$nulls":5},30,null,null,30,"海運"]
[{"$nulls":5},32,32,{"$nulls":5},31,"鳥取県",32,1992,1992,{"$nulls":5},31,null,null,31,"空運"]
[{"$nulls":5},33,33,{"$nulls":5},32,"島根県",33,1991,1991,{"$nulls":5},32,null,null,32,"倉庫・運輸関連"]
[{"$nulls":5},34,34,{"$nulls":5},33,"岡山県",34,1990,1990,{"$nulls":5},33,null,null,33,"通信"]
[{"$nulls":5},35,35,{"$nulls":5},34,"広島県",35,1989,1989,{"$nulls":5},34,null,null,34,"電力"]
[{"$nulls":5},36,36,{"$nulls":5},35,"山口県",36,1988,1988,{"$nulls":5},35,null,null,35,"ガス",{"$nulls":3},"2019-03-24","KSSYS"]
[{"$nulls":5},37,37,{"$nulls":5},36,"徳島県",37,1987,1987,{"$nulls":5},36,null,null,36,"サービス業  ",null,1,"自社ビル","←バグ修正（集計側は変換処理を削除する）"]
[{"$nulls":5},38,38,{"$nulls":5},37,"香川県",38,1986,1986,{"$nulls":5},37,null,null,37,"その他",null,2,"賃貸ビル","←バグ修正（集計側は変換処理を削除する）"]
[{"$nulls":5},39,39,{"$nulls":5},38,"愛媛県",39,1985,1985,{"$nulls":5},38]
[{"$nulls":5},40,40,{"$nulls":5},39,"高知県",40,1984,1984,{"$nulls":5},39]
[{"$nulls":5},41,41,{"$nulls":5},40,"福岡県",41,1983,1983,{"$nulls":5},40]
[{"$nulls":5},42,42,{"$nulls":5},41,"佐賀県",42,1982,1982,{"$nulls":5},41]
[{"$nulls":5},43,43,{"$nulls":5},42,"長崎県",43,1981,1981,{"$nulls":5},42]
[{"$nulls":5},44,44,{"$nulls":5},43,"熊本県",44,1980,1980,{"$nulls":5},43]
[{"$nulls":5},45,45,{"$nulls":5},44,"大分県",45,1979,1979,{"$nulls":5},44]
[{"$nulls":5},46,46,{"$nulls":5},45,"宮崎県",46,1978,1978,{"$nulls":5},45]
[{"$nulls":5},47,47,{"$nulls":5},46,"鹿児島県",47,1977,1977,{"$nulls":5},46]
[{"$nulls":5},48,48,{"$nulls":5},47,"沖縄県",48,1976,1976,{"$nulls":5},47]
[{"$nulls":5},49,49,{"$nulls":7},49,1975,1975,{"$nulls":5},48]
[{"$nulls":5},50,50,{"$nulls":7},50,1974,1974,{"$nulls":5},49]
[{"$nulls":5},51,51,{"$nulls":7},51,1973,1973,{"$nulls":5},50]
[{"$nulls":5},52,52,{"$nulls":7},52,1972,1972,{"$nulls":5},51]
[{"$nulls":5},53,53,{"$nulls":15},52]
[{"$nulls":5},54,54,{"$nulls":15},53]
[{"$nulls":5},55,55,{"$nulls":15},54]
[{"$nulls":5},56,56,{"$nulls":15},55]
[{"$nulls":5},57,57,{"$nulls":15},56]
[{"$nulls":5},58,58,{"$nulls":15},57]
[{"$nulls":5},59,59,{"$nulls":15},58]
[{"$nulls":5},60,60,{"$nulls":15},59]
[{"$nulls":5},61,61,{"$nulls":15},60]
[{"$nulls":5},62,62,{"$nulls":15},61]
[{"$nulls":5},63,63,{"$nulls":15},62]
[{"$nulls":5},64,64,{"$nulls":15},63]
[{"$nulls":5},65,65,{"$nulls":15},64]
[{"$nulls":5},66,66,{"$nulls":15},65]
[{"$nulls":5},67,67,{"$nulls":15},66]
[{"$nulls":5},68,68,{"$nulls":15},67]
[{"$nulls":5},69,69,{"$nulls":15},68]
[{"$nulls":5},70,70,{"$nulls":15},69]
[{"$nulls":5},71,71,{"$nulls":15},70]
[{"$nulls":5},72,72,{"$nulls":15},71]
[{"$nulls":5},73,73,{"$nulls":15},72]
[{"$nulls":5},74,74,{"$nulls":15},73]
[{"$nulls":5},75,75,{"$nulls":15},74]
[{"$nulls":5},76,76,{"$nulls":15},75]
[{"$nulls":5},77,77,{"$nulls":15},76]
[{"$nulls":5},78,78,{"$nulls":15},77]
[{"$nulls":5},79,79,{"$nulls":15},78]
[{"$nulls":5},80,80,{"$nulls":15},79]
[{"$nulls":5},81,81,{"$nulls":15},80]
[{"$nulls":5},82,82,{"$nulls":15},81]
[{"$nulls":5},83,83,{"$nulls":15},82]
[{"$nulls":5},84,84,{"$nulls":15},83]
[{"$nulls":5},85,85,{"$nulls":15},84]
[{"$nulls":5},86,86,{"$nulls":15},85]
[{"$nulls":5},87,87,{"$nulls":15},86]
[{"$nulls":5},88,88,{"$nulls":15},87]
[{"$nulls":5},89,89,{"$nulls":15},88]
[{"$nulls":5},90,90,{"$nulls":15},89]
[{"$nulls":5},91,91,{"$nulls":15},90]
[{"$nulls":5},92,92,{"$nulls":15},91]
[{"$nulls":5},93,93,{"$nulls":15},92]
[{"$nulls":5},94,94,{"$nulls":15},93]
[{"$nulls":5},95,95,{"$nulls":15},94]
[{"$nulls":5},96,96,{"$nulls":15},95]
[{"$nulls":5},97,97,{"$nulls":15},96]
[{"$nulls":5},98,98,{"$nulls":15},97]
[{"$nulls":5},99,99,{"$nulls":15},98]
[{"$nulls":22},99]

{"sheet":"Sheet3","index":9,"n_rows":0,"n_cols":0,"rows_kept":0,"hidden":true}

{"sheet":"Sheet4","index":10,"n_rows":0,"n_cols":0,"rows_kept":0,"hidden":true}